##TITLE=kyra_KLS-07-200-supersaturated-forSI-C-CDCl3-NMR1
##JCAMPDX= 6.0         $$ Bruker NMR JCAMP-DX V2.0
##DATA TYPE= NMR FID
##DATA CLASS= NTUPLES
##ORIGIN= Bruker BioSpin GmbH
##OWNER= nmrsu
##LONG DATE= 2025/11/28 11:51:07+0000
$$ 1.90.2.2 TopSpin 3.5 pl 7
$$ 2025-11-28 06:51:07.641 -0500  nmrsu@nmr1
$$ Compression mode = diff/dup
##.OBSERVE FREQUENCY= 125.770364305
##.OBSERVE NUCLEUS= ^13C
##.DELAY= (6.5, 6.5)
##.ACQUISITION MODE= SIMULTANEOUS (DQD)
##.ACQUISITION SCHEME= undefined
##.AVERAGES= 7500
##.DIGITISER RES= 21
##SPECTROMETER/DATA SYSTEM= spect
##.PULSE SEQUENCE= zgpg30
##.SOLVENT NAME= CDCl3
##.SHIFT REFERENCE= INTERNAL, CDCl3, 1, 218.3265
##AUDIT TRAIL= $$ (NUMBER, WHEN, WHO, WHERE, PROCESS, VERSION, WHAT)
$$ ##TITLE= Audit trail, TopSpin 3.5 pl 7
$$ ##JCAMPDX= 5.01
$$ ##ORIGIN= Bruker BioSpin GmbH
$$ ##OWNER= nmrsu
$$ $$ /home/nmrsu/Data/KimTemporaryHold/2025/kyra_KLS-07-200-supersaturated-forSI-C-CDCl3-NMR1/10/audita.txt
$$ ##AUDIT TRAIL=  $$ (NUMBER, WHEN, WHO, WHERE, PROCESS, VERSION, WHAT)
(   1,<2025-11-28 06:51:07.175 -0500>,<nmrsu>,<nmr1>,<go4>,<TopSpin 3.5.7>,
      <created by zg
	started at 2025-11-27 20:05:14.322 -0500,
	POWCHK enabled, PULCHK disabled,
       configuration hash MD5:
       CF 14 E6 8B E5 54 F3 91 5A AB C4 80 1C EB 85 24
       data hash MD5: 64K
       B9 2A 85 67 4B 3B DC 18 05 4E 66 F0 F9 42 93 42>)
(   2,<2025-11-28 06:51:07.209 -0500>,<nmrsu>,<nmr1>,<audit>,<TopSpin 3.5.7>,
      <user comment:
       ICON-NMR User ID: kim_new
       data hash MD5: 64K
       B9 2A 85 67 4B 3B DC 18 05 4E 66 F0 F9 42 93 42>)
$$ ##END=
$$ 
$$ $$ hash MD5
$$ $$ 23 E2 CB D8 89 01 CE 16 5C 2A 5E 2D BC 6C 37 C0
##$RELAX= 
##$RELAX= 
##$RELAX= 
##$RELAX= 
##$RELAX= 
##$RELAX= 
##$RELAX= 
##$RELAX= 
##$RELAX= 
##$RELAX= 
##$RELAX= 
##$RELAX= 
##$RELAX= 
$$ Bruker specific parameters
$$ --------------------------
##$DATPATH= </home/nmrsu/Data/KimTemporaryHold/2025>
##$EXPNO= 10
##$NAME= <kyra_KLS-07-200-supersaturated-forSI-C-CDCl3-NMR1>
##$PROCNO= 1
##$ACQT0= -2.10084033613445
##$AMP= (0..31)
100 100 100 100 100 100 100 100 100 100 100 100 100 100 100 100 100 100
100 100 100 100 100 100 100 100 100 100 100 100 100 100
##$AMPCOIL= (0..19)
0 0 0 0 0 0 0 0 0 0 0 0 0 0 0 0 0 0 0 0
##$ANAVPT= -1
##$AQSEQ= 0
##$AQ_mod= 3
##$AUNM= <au_zg>
##$AUTOPOS= <2 >
##$BF1= 125.757789
##$BF2= 500.13
##$BF3= 125.757789
##$BF4= 125.757789
##$BF5= 125.757789
##$BF6= 125.757789
##$BF7= 125.757789
##$BF8= 125.757789
##$BWFAC= (0..63)
0 0 0 0 0 0 0 0 0 0 0 0 0 0 0 0 0 0 0 0 0 0 0 0 0 0 0 0 0 0 0 0 0 0 0 0
0 0 0 0 0 0 0 0 0 0 0 0 0 0 0 0 0 0 0 0 0 0 0 0 0 0 0 0
##$BYTORDA= 0
##$CAGPARS= (0..11)
0 0 0 0 0 0 0 0 0 0 0 0
##$CHEMSTR= <none>
##$CNST= (0..63)
1 1 1 1 1 1 1 1 1 1 1 1 1 1 1 1 1 1 1 1 1 1 1 1 1 1 1 1 1 1 1 1 1 1 1 1
1 1 1 1 1 1 1 1 1 1 1 1 1 1 1 1 1 1 1 1 1 1 1 1 1 1 1 1
##$CPDPRG= (0..8)
<> <> <waltz16> <> <> <> <> <> <>
##$D= (0..63)
0 4 0 0 0 0 0 0 0 0 0 0.03 0 0 0 0 0.0002 0 0 0 0 0 0 0 0 0 0 0 0 0 0 0
$$ [...]
##$USERA4= <>
##$USERA5= <>
##$V9= 5
##$VALIDCODE= -1
##$VALIST= <>
##$VCLIST= <>
##$VDLIST= <>
##$VPLIST= <>
##$VTLIST= <>
##$WBST= 1024
##$WBSW= 4
##$XGAIN= (0..3)
0 0 0 0
##$XL= 0
##$YL= 0
##$YMAX_a= 10959872
##$YMIN_a= -11182780
##$ZGOPTNS= <>
##$ZL1= 120
##$ZL2= 120
##$ZL3= 120
##$ZL4= 120
##$ABSF1= 240
##$ABSF2= -10
##$ABSG= 5
##$ABSL= 3
##$ALPHA= 0
##$AQORDER= 0
##$ASSFAC= 0
##$ASSFACI= 0
##$ASSFACX= 0
##$ASSWID= 0
##$AUNMP= <proc_1d>
##$AXLEFT= 0
##$AXNAME= <>
##$AXNUC= <off>
##$AXRIGHT= 0
##$AXTYPE= 0
##$AXUNIT= <>
##$AZFE= 0.1
##$AZFW= 0.5
##$BCFW= 1
##$BC_mod= 2
##$BYTORDP= 0
##$COROFFS= 0
##$CY= 15
##$DATMOD= 1
##$DC= 1
##$DFILT= <>
##$DTYPP= 0
##$ERETIC= no
##$F1P= 240
##$F2P= -10
##$FCOR= 0.5
##$FTSIZE= 0
##$FT_mod= 0
##$GAMMA= 1
##$GB= 0
##$INTBC= 1
##$INTSCL= 1
##$ISEN= 30
##$LB= 1
##$LEV0= 0
##$LPBIN= 0
##$MAXI= 10000
##$MC2= 0
##$MEAN= 0
##$ME_mod= 0
##$MI= 0
##$MddCEXP= no
##$MddCT_SP= no
##$MddF180= no
##$MddLAMBDA= 0
##$MddMEMORY= 0
##$MddMERGE= 0
##$MddNCOMP= 0
##$MddNITER= 0
##$MddNOISE= 0
##$MddPHASE= 0
##$MddSEED= 0
##$MddSRSIZE= 0
##$Mdd_CsALG= 0
##$Mdd_CsLAMBDA= 1
##$Mdd_CsNITER= 0
##$Mdd_CsNORM= 0
##$Mdd_CsVE= yes
##$Mdd_CsZF= 0
##$Mdd_LrLAMBDA= 0
##$Mdd_LrNITER= 0
##$Mdd_LrRANK= 0
##$Mdd_LrZF= 0
##$Mdd_mod= 0
##$NCOEF= 0
##$NC_proc= 0
##$NLEV= 6
##$NOISF1= 0
##$NOISF2= 0
##$NSP= 1
##$NTH_PI= 0
##$NZP= 1
##$OFFSET= 218.3265
##$PC= 1.4
##$PHC0= -17.61481
##$PHC1= -81.81285
##$PH_mod= 0
##$PKNL= yes
##$PPARMOD= 0
##$PPDIAG= 0
##$PPIPTYP= 0
##$PPMPNUM= 2147483647
##$PPRESOL= 1
##$PSCAL= 4
##$PSIGN= 0
##$PYNMP= <proc.py>
##$RDF1= 0
##$RDF2= 0
##$RDFWHM= 0
##$RDINT= 0
##$RDPOS= 0
##$REVERSE= no
##$SF= 125.757789
##$SI= 32768
##$SIGF1= 0
##$SIGF2= 0
##$SINO= 0
##$SIOLD= 32768
##$SPECTYP= <>
##$SREF_mod= 1
##$SREGLST= <13C.CDCl3>
##$SSB= 0
##$STSI= 0
##$STSR= 0
##$SW_p= 29761.9047620009
##$SYMM= 0
##$S_DEV= 0
##$TDeff= 0
##$TDoff= 0
##$TI= <kyra_KLS-07-200-supersaturated-forSI-C-CDCl3-NMR1

>
##$TILT= no
##$TM1= 0
##$TM2= 0
##$TOPLEV= 0
##$USERP1= <>
##$USERP2= <>
##$USERP3= <>
##$USERP4= <>
##$USERP5= <>
##$WDW= 1
##$XDIM= 0
##$YMAX_p= 0
##$YMIN_p= 0
##$CURPLOT= <A4>
##$CURPRIN= <$1#1#0#1#1#1#1#1#0#-1#-1#1#-1>
##$DFORMAT= <normdp>
##$LAYOUT= <+/1D_X.xwp>
##$LFORMAT= <normlp>
##$PFORMAT= <normpl>
$$ End of Bruker specific parameters
$$ ---------------------------------
##NTUPLES= NMR FID
##VAR_NAME=  TIME,          FID/REAL,        FID/IMAG
##SYMBOL=    X,             R,               I
##VAR_TYPE=  INDEPENDENT,   DEPENDENT,       DEPENDENT
##VAR_FORM=  AFFN,          ASDF,            ASDF
##VAR_DIM=   32768,         32768,           32768
##UNITS=     SECONDS,       ARBITRARY UNITS, ARBITRARY UNITS
##FACTOR=    3.36e-05,      1,               1
##FIRST=     0,             0,               0
##LAST=      1.1009712,     12889,           -78344
##MIN=       0,             -11182780,       -11182780
##MAX=       1.1009712,     10959872,        10959872
$$ Real data points
##PAGE= N=1
##DATA TABLE= (X++(R..R)), XYDATA
0@@@@@@@@@@@@@@@@AhC7a28B83e15G97a053A245a470A698a922B235b574B919c371
32C855d384D858e481F187f870G811h642I633a0673A1883a3187A4536a6194A7819
47a9664B1711b3877B6396b9136C2172c5531C9344d3648D8538e4210F0904f8782
60G8353i0218A05499a25895A54793a99171B77671d61163A0824440a096837l197305
70d294142k701759j429021b508733A824940L290995J094709L0592j950097a000378
80c882317j7865l050634L349465B710513l8109J143076K357126k731062F28873
90a963902k720486q75177o1095a664193A919432J193711M118524m7294H70625
100b077895k720935l211174K988176b383000g08692C250250L368353J098338l361922
$$ y = [0, 0, 0, 0, 0, 0, 0, 0, 0, 0, 0, 0, 0, 0, 0, 0, 1, -8, 37, -128, 283, -515, 797, -1053, 1245, -1470, 1698, -1922, 2235, -2574, 2919, -3371, 3855, -4384, 4858, -5481, 6187, -6870, 7811, -8642, 9633, -10673, 11883, -13187, 14536, -16194, 17819, -19664, 21711, -23877, 26396, -29136, 32172, -35531, 39344, -43648, 48538, -54210, 60904, -68782, 78353, -90218, 105499, -125895, 154793, -199171, 277671, -461163, 10824440, -1096837, -4294142, -6995901, -8424922, -2508733, 1824940, 5115935, 6210644, 6241236, 4291139, -1000378, -3882317, -3900182, -6950816, -3601351, 2710513, 2672404, 3815480, 6172606, 3441544, 628873, -1963902, -4684388, -5559565, -5620660, -1664193, 1919432, 3113143, 7231667, 7184373, 870625, -2077895, -4798830, -8010004, -5021828, -2383000, -708692, 3250250, 6618603, 7716941, 4355019]
109D355019d44066k339460n351866j884045c399628C95267K475355N698188o65503
118G903307C131110B21219b658001k069318j561817J317762c93036A138934L199015
127D337949M264457l509963A241024h66385m277678l45421K021805N74421H25595
137D201631J179519p34809A591190A13983b500068l857929K132842b032039L72827
146a659212C255626K333729k436829l42156j300905a891108l238941j924846K631213
155d423682a250403A770309N413759l71963B792485j220379c010223l415337J645806
164d779754L49389J760693A692471L063670K238349q25910k607751C47078f304830
174h812277L553534K118791B035705M939563j458478j271836q39793C30028a922054
$$ y = [4355019, -444066, -2783526, -8135392, -10019437, -3399628, 395267, 2870622, 8568810, 7903307, 3131110, 221219, -2658001, -4727319, -6289136, -4971374, -393036, 1138934, 4337949, 8602406, 5092443, 1241024, -866385, -5144063, -5489484, -3467679, -2893258, 825595, 4201631, 5381150, 4646341, 1591190, 113983, -2500068, -6357997, -4225155, -2032039, -1659212, 3255626, 5589355, 3152526, 2810370, 1509465, -1891108, -5130049, -7054895, -4423682, -1250403, 1770309, 7184068, 6812105, 2792485, 1572106, -3010223, -6425560, -4779754, -4430365, -2669672, 1692471, 4756141, 6994490, 6168580, 3560829, 347078, -6304830, -8812277, -5258743, -3139952, 2035705, 6975268, 5516790, 4244954, 3405161, 330028, -1922054]
184d851663j129435K003153J753863A710250L665779k14010M92884B805519c023209
194c591072o01897j251144b639691d39925A566787K706502J172975m39214G78142
204d100305l29764j164018K99340B63994K215383O78707K119561j716337A131764
214a730660l478516L17309J390138a212144B964922J623019L56853j286601a402823
224b780611Q39270j355513J252005h6995j54334B510347K018060p6963B211942
234a729531j234608n34327j258116i43550A967115m16482J704745k43972A062329
244A775607A3782c130952j079750n56068b267492G61974K980773K529070l059283
253C212534b93895J27949l059843j597861b073653J39688i11155B311137J392338
$$ y = [-4851663, -5981098, -3977945, -2224082, 1710250, 5376029, 5162019, 5654903, 2805519, -3023209, -3591072, -4192969, -5444113, -2639691, -439925, 1566787, 4273289, 5446264, 5007050, 778142, -4100305, -4430069, -5594087, -5294747, 263994, 2479377, 3158084, 5277645, 3561308, 1131764, -1730660, -5209176, -4891867, -3501729, -1212144, 2964922, 4587941, 4944794, 3658193, -1402823, -2780611, -1941341, -3296854, -2044849, -86995, -241329, 2510347, 4528407, 4451444, 2211942, -1729531, -2964139, -3498466, -4756582, -943550, 1967115, 1550633, 3255378, 3011406, 1062329, 1775607, 13782, -3130952, -4210702, -4766770, -2267492, 761974, 3742747, 6271817, 3212534, -293895, -165946, -3225789, -4823650, -2073653, -1933965, -911155, 2311137, 3703475]
262C703475Q0176A634549h3407j049435l294110K36723e61987C84975J891213
271B276188J046155I09513M9562J44627a659660o29558N19944P17829G35515P38539
281A474054J231070j177131i13471G05710f9371k873379f32677A67138a768730
291A27131J960705J46509k80829E59609a90002k451604j563490a164690c17635
301a87846B620582n42736o81548J695070A017942b169848j393613n80324J489091
310b654694d46501B099685K486063j552309r89776q55271c204941K1093d94226
320a951993L20552F19865N61848J065378M4306j124529A83564a636042g47636
330d91795j577562a49698D12144a257630A167627J128228B98042O51468j12835
$$ y = [3703475, 3783651, 1634549, -83407, -1132842, -4426952, -4190229, -561987, 384975, 2276188, 3322343, 909513, 959075, 1103702, -1659660, -2289218, -1769274, -1051445, 735515, 1474054, 2705124, 1527993, -913471, 705710, -69371, -2942750, -632677, 167138, -1768730, 127131, 2087836, 2234345, 1953516, 559609, -190002, -2641606, -4205096, -1164690, -317635, -187846, 2620582, 2077846, 1396298, 3091368, 1017942, -2169848, -3563461, -4143785, -2654694, -446501, 2099685, 4585748, 3033439, 2043663, 1188392, -3204941, -3183848, -494226, -1951993, -1631441, 619865, 1181713, 2247091, 2291397, 1166868, 183564, -1636042, -747636, -491795, -2069357, -149698, 412144, -1257630, 1167627, 2295855, 298042, 949510, 836675]
339H36675g07736r87402L6433e4389o87696j11496B412782r24804f59774A749449
350F01576b464256R92844c60746A007646L07308g1093j30081j088762L06653A067472
361B5266L01368J224113d28220j56071F87423i10053L43216D89793a037752J11135
371i26617H01130J641165p21427a158949e49755J09585k173495C62186K343121
380B705307c12804J8738D99908e94961J93170a8774D76203A92375g11980I58097
391H74857g98510I24943A31766b097420e27633b7614H9394J545645D65073d33024
402D1782K60037Q06350g00658j057096A53842i47985N732A363923B25677O1067
412B86744J319763B51978l9403J84493g54881n65040j037017O00438G48610N62081
$$ y = [836675, -707736, -1695138, -1658705, -54389, -742085, -853581, 2412782, 1487978, -659774, 1749449, 601576, -2464256, -1471412, -360746, 1007646, 1314954, -71093, -201174, -1289936, -983283, 1067472, 25266, 326634, 1550747, -428220, -584291, 687423, -910053, -566837, 489793, -1037752, -926617, 801130, 2442295, 1720868, -1158949, -549755, -440170, -2613665, 362186, 2705307, -312804, -294066, 499908, -594961, -401791, -18774, 476203, 192375, -711980, 958097, 874857, -798510, 924943, 131766, -2097420, -527633, -27614, 89394, 1635039, 465073, -433024, 41782, 301819, 1108169, -700658, -1757754, 153842, -947985, -942253, 1363923, 225677, 286744, 1606507, 251978, 212575, 397068, -754881, -1319921, -2356938, -1756500, 748610, 1310691]
422A310691J615561o73h58355k08714d13578j875926h77895B764g32745a56496
433A096588J526022p81339h65496L87150k31269j987846b35785A473397p33829
442G39568M58278c74508j135119c47333F3424J237887k49191a099255c75260B89430
453E9797O35632i20313j03101F67871i82797d36750A808121B69040a4703B63210
464H0308Q03562b65485j74151q6899k360484J239083A415559k95077J444971L23080
474B888533B89022d07159q59461j224102M19120o84718a088151B318725P30759
483C049484P15132j354686i28514l26725j611435j145537h79254C90923N24094
492I15017J202281A026703N96211K60292a42227o81629j688043p70174f06581
$$ y = [1310691, 2926252, 2925579, -858355, -1067069, -413578, -2289504, -877895, 2764, -732745, -156496, 1096588, 2622610, 1841271, -865496, -478346, -709615, -2697461, -235785, 1473397, 739568, 1197846, -374508, -1509627, -347333, 63424, 1301311, 1052120, -1099255, -375260, 289430, 59797, 695429, -920313, -1023414, 667871, -982797, -436750, 1808121, 269040, -14703, 263210, 80308, 883870, -265485, -439636, -526535, -2887019, -1647936, 1415559, 1120482, 2565453, 2888533, 289022, -407159, -1266620, -2490722, -2071602, -2756320, -1088151, 2318725, 3049484, 3764616, 2409930, -928514, -1255239, -2866674, -4012211, -879254, 390923, 915017, 2117298, 1026703, 1622914, 1883206, -142227, -823856, -2511899, -3282073, -606581]
502B98549N04800J615713H05715J54678N03266g95798J2825k95670j758831J036255
512a801219c41265A628972J761995j309057l62587B67492c634058P14055a299782
522a430580F76604J187482J7712J418841j537300a81898j575396k418440J492024
531b683710g78735f4955B458367N19880p04484K92783f48535j795443J195289
540a248689j567487j2709h19705E15253K501194J9836q32723m33083a650557o10530
550b261087g51078k110091L32668a4090I7331K061293J448913r52922j007210
559A647405i52946j491881J87839r45069a474472F02083k64957K437552L80020
568C154698I65878P21341C43174b881089r55391R91572a56477A802436l3762R11995
$$ y = [298549, 803349, 2419062, 805715, 960393, 1463659, -795798, -782973, -1078643, -2837474, -1801219, -341265, 1628972, 3390967, 2081910, 1719323, 267492, -3634058, -2920003, -1299782, -1430580, 676604, 1864086, 1881798, 3300639, 1763339, -181898, -1757294, -4175734, -2683710, -778735, -64955, 2458367, 2978247, 2273763, 2566546, -648535, -2443978, -1248689, -2816176, -2828885, -819705, 515253, 3016447, 3036283, 2203560, 1770477, -1650557, -2261087, -751078, -2861169, -2528501, -14090, 97331, 2158624, 3607537, 2654615, 1647405, -952946, -2444827, -2256988, -3202057, -1474472, 602083, 337126, 2774678, 3154698, 965878, 1687219, 343174, -2881089, -3836480, -2844908, -156477, 1802436, 1768674, 2680669]
578B680669A261887a173509C99350g50853j824843d67499f8032a6723A444291
588H60001q8889k94809a344552K68197L25830A76509J734121E741b52217I00441
599a314796b37941A609322e64754p03353f04906a27166H50967B69979Q05681N32105
609A607765i97978D1770P64165b355013O76331b2587p13484G09540J321885M73309
619B504734j24601d55640j690586m21705J22786D43746O07326a05167B083272
629A489734D8816R37384h05833j477169J095342L69798B39663Q45666j1959L60452
639A433822g24650j000412E11953a483E5141J520846e81845n49139A42869b5341
650A034486k44012f79422J7313n17751G16129Q88028i76662B50967J430305f86540
$$ y = [2680669, 1261887, -1173509, 399350, -750853, -2575696, -467499, -68032, -16723, 1444291, 860001, 771112, 476303, -1344552, -1076355, -750525, 176509, 1910630, 5741, -252217, 900441, -1314796, -237941, 1609322, -564754, -1268107, -604906, -127166, 850967, 269979, 1075660, 1607765, -997978, 41770, 805935, -2355013, -1678682, -22587, -736071, 709540, 2031425, 2504734, 2380133, -455640, -2146226, -2567931, -2445145, 443746, 1051072, -105167, 2083272, 1489734, 48816, 986200, -805833, -2283002, -1187660, -817862, 239663, 1085329, 1073370, 1433822, -724650, -1725062, 511953, -1483, 55141, 1575987, -581845, -1130984, 142869, -25341, 1034486, 790474, -679422, -662109, -1179860, 716129, 1604157, -976662, 250967, 1681272, -686540]
661F7993J008177h78183o8166l00040L40133B60533N43134K054777m11884a461118
672a068029d93750j378164g44066k0489j09699A065946J61313L88230L91141b98012
683a262611m73430o7785b68079p3294J50204A777621b00343j51863B055331E01382
694d02723E4867a077575k50349M22722D73163P23871a250215K47746B013731o61483
704A352248O531J48121a243909n18301P3111J17306D02127K67837M65028N92907
714A727899e7623C85002P74524a87041M3718j084287j311879B9031P77305k20430
724E85906O99868F2560c50283D82585j68911N49067a96670k121147P78455J32015
734a407347f00700B055406n53082j07179M42543a012261r15181O38332n58812
$$ y = [67993, 1076170, -878183, -946349, -1246389, -906256, 260533, 803667, 2858444, 2446560, -1461118, -1068029, -493750, -1871914, -744066, -764555, -874254, 1065946, 1227259, 1615489, 2006630, -298012, -1262611, -1736041, -1803826, -268079, -341373, -191169, 1777621, -200343, -352206, 2055331, 501382, -402723, 54867, -1077575, -1327924, -905202, 473163, 1197034, -1250215, -1002469, 2013731, 1352248, 1358779, 1506900, -1243909, -1762210, -1689099, -1571793, 402127, 669964, 1134992, 1727899, -57623, 385002, 1159526, -187041, -143323, -1227610, -2539489, 29031, 806336, 585906, 1285774, 62560, -350283, 482585, 313674, 862741, -196670, -2317817, -1539362, -1407347, -600700, 2055406, 1502324, 1395145, 1837688, -1012261, -1927442, -1289110, -1847922]
743a847922g52708c34350E47988K158407p26755q99298B6051c385824O28224b00737
754a07377A099530P06313k94721L49083A64625a020244b57395j831192m7854f80351
765E234K018504O12784r01128j61500f68406j169900c37072j417209q27827J283079
775a299029O48716A500997K031567J93383m89739h57198k902899N23852r49163
784d185408J136182C63981J460799J690797M42214j654619n11672e60163l605747
793d165910m12437k78424b352289B259718J488947R12486r40900H73217C95826
803a797981k539169J220460J026156i57739B041714J090432Q39245p68850C55847
813f25944j618084j406951a688458M05279c90554B655219K6608P3584J7716A37723
$$ y = [-1847922, -752708, -334350, 547988, 2706395, 1979640, 1080342, 26051, -3385824, -2757600, -200737, -107377, 1099530, 1805843, 1511122, 1860205, 164625, -1020244, -257395, -2088587, -2136441, -680351, 5234, 2023738, 2636522, 1735394, 1573894, -668406, -1838306, -337072, -1754281, -2582108, -1299029, -650313, 1500997, 3532564, 3725947, 3236208, -857198, -3760097, -3236245, -4185408, -3049226, 363981, 1824780, 3515577, 3957791, 2303172, 1791500, -560163, -4165910, -4578347, -4856771, -2352289, 2259718, 3748665, 4661151, 3720251, 873217, 395826, -1797981, -4337150, -3116690, -2090534, -957739, 2041714, 3132146, 3971391, 3202541, 355847, -625944, -2244028, -3650979, -1688458, -1283179, -390554, 2655219, 2681827, 2755411, 2773127, 137723]
824b582752r24800N5097a032554E0847J317667J757443j489339P4871K01360b242913
835c963928P39172j037g19627A744042K258425J109650B118844a065029j738837
844b803866j954985J680914a209518J74973B005082J743414n76468P48720A319040
854b495957j219663n93528J403703c25957A813569K705297r60948A463449P69357
863B232806c69370k919049J197162n63137p6350f8302B072947K105171k26115
872C952003A874719G18239b285387j397375J225223j088340J538826B262446J199751
881C462197J006856l51057B46304b570970k019837o18131K081746h81069C004182
891E194323k228847k94679r98957b792069j589937m11700m19434a181563B833962
$$ y = [-2582752, -3507552, -3452455, -1032554, 50847, 1368514, 3125957, 1636618, 1711489, 1912849, -2242913, -3963928, -3224756, -3225793, -719627, 1744042, 4002467, 5112117, 2118844, -1065029, -2803866, -4758851, -3077937, -1209518, -1034545, 2005082, 3748496, 3172028, 3920748, 1319040, -2495957, -3715620, -4309148, -2905445, -325957, 1813569, 4518866, 3557918, 1463449, 2232806, -369370, -3288419, -2091257, -2654394, -2730744, -68302, 2072947, 4178118, 3952003, 1874719, 718239, -2285387, -3682762, -2457539, -3545879, -2007053, 2262446, 3462197, 4469053, 4117996, 246304, -2570970, -4590807, -5208938, -3127192, -881069, 3004182, 5194323, 2965476, 2670797, 1671840, -2792069, -4382006, -4793706, -5213140, -1181563, 2833962]
901E762021Q24630l179893D94582b613152k606004J073510Q34192J031019A736390
911C527487R86559K113274k534746A10905b900470l452813n82522K192963c33051
921D814741L08960j93783J324471B544789a844691k320317l415873L2960L671215
930c876706G04630M859147J768010n58870k026845a217999m100240j072569r38245
939g329053K761585g67403B048944M468397J322312l020916A726514c025487l761166
948f786653L13379J595510g56926B466692Q56169K821529m89081B181083C05582
958c658977l311158J649745K348559E04858M021737J518840o7621B779296a141290
968b248260j932541r64221K042709M93933I16815N571892M46944j575436A743260
$$ y = [5762021, 6586651, 3406758, 494582, -2613152, -5219156, -4145646, -3311454, -2280435, 1736390, 3527487, 4514046, 6627320, 4092574, 110905, -2900470, -6353283, -6935805, -4742842, -333051, 4814741, 5123701, 4929918, 6254389, 2544789, -1844691, -4165008, -7580881, -7547921, -3876706, 704630, 5563777, 7331787, 6772917, 4746072, -1217999, -5318239, -6390808, -7329053, -4567468, -767403, 2048944, 6517341, 7839653, 4818737, 1726514, -3025487, -6786653, -6473274, -4877764, -756926, 2466692, 3322861, 6144390, 5655309, 2181083, 305582, -3658977, -6970135, -5320390, -2971831, 504858, 4526595, 6045435, 5977814, 2779296, -1141290, -2248260, -4180801, -5145022, -3102313, -2608380, 916815, 6488707, 6935651, 5360215, 1743260]
978c250730k439276j521757J517204g70959A820128K588769K176421j929098k181103
987B475117c04112m627401j811293j11687K088501A517890L719459J167311J17261
996F521921B521160a160607k657968j747203J130947O86859a848482C700093J818349
1005E518442r18513p1509A275175a943278k121573j444033K340457a030870G51303
1015D052317J66735q13538M00B70956c287028j741090o34216b041617A547830
1025B614851K820683o10447A555040a72817l114967j477837k6302O73830D04409
1035C871363Q31441J778412k673211a957228k503273j974121L79296b224700A061100
1045D202864J025215j224238o9994H45157c453097j406670j632509J457703D0051
$$ y = [-3250730, -5690006, -7211763, -5694559, -770959, 1820128, 4408897, 6585318, 4656220, 2475117, -304112, -4931513, -6742806, -6854493, -4765992, 1517890, 5237349, 6404660, 6521921, 2521160, -1160607, -3818575, -5565778, -4434831, -3747972, -1848482, 3700093, 5518442, 4599929, 4528420, 1275175, -1943278, -4064851, -5508884, -3168427, -1030870, 751303, 4052317, 4219052, 3405514, 3405914, 270956, -3287028, -5028118, -5662334, -2041617, 1547830, 2614851, 5435534, 4825087, 1555040, -172817, -3287784, -4765621, -4791923, -4118093, 404409, 3871363, 4702804, 6481216, 3808005, -1957228, -4460501, -6434622, -6055326, -2224700, 1061100, 4202864, 5228079, 4003841, 3933847, 845157, -3453097, -4859767, -6492276, -5034573, 40051]
1055B339563K421534J870784k070670B004214a682725l087390J14596n48663J532233
1064c671949G22347K086038L154032J533824l661462F05911b743356l671864L93379
1073f021841J425794a983402B517207K828503J593136j058205A363545a531698
1082e400681k908716L907165a347644C79343M429217J557097j719656B030532
1091a116723j926893k374925j016843b661558F4809K830100M366737j632067A625285
1101c81746k995172j064976M38230L84018d89693B232716J523404J512825j490705
1110C778240j830170b80370m973212n31019K093220J118906A396403L643183o15893
1119D423693j78642j218495D68423b633876l253079M87145J866388a724690C824757
$$ y = [2339563, 4761097, 6631881, 4561211, 2004214, -1682725, -4770115, -4655519, -5204182, -3671949, 722347, 2808385, 5962417, 7496241, 3834779, 605911, -2743356, -6415220, -6021841, -4596047, -1983402, 2517207, 5345710, 6938846, 5880641, 1363545, -1531698, -5400681, -8309397, -4402232, -1347644, 379343, 4808560, 6365657, 4646001, 2030532, -1116723, -3043616, -5418541, -6435384, -2661558, 64809, 2894909, 7261646, 5629579, 1625285, -381746, -3376918, -4441894, -4003664, -3619646, -489693, 2232716, 3756120, 5268945, 3778240, 1948070, -280370, -5253582, -5784601, -3691381, -2572475, 1396403, 5039586, 4423693, 4245051, 3026556, 468423, -2633876, -5886955, -5399810, -3533422, -1724690, 3824757]
1129F644958k266255n73767A358839c189549j357398r07783R85611a306929A345160
1139D590684L05563j190067o36897a787432l875380K028645O58245J293896A709180
1149A987138O4020R41748m51209j194420a851663j724453R06174n58323a207676
1159B879336j25371M4457k17839d31116n32950j57192j527372M10446N46694h1161
1170B157832R80284J440549j963342b872383o18710L35963n52156A16031K428645
1179B544676l23957Q39223l73265A213353a056141k299694Q40279l47750k08202
1188c071508A273027K197282k48017M43001F36688a960990M14194o57537M3562
1197b160771N62512M78417A127320Q78954O52054O81029A78364a590809M81078
$$ y = [6644958, 4378703, 3804936, 1358839, -3189549, -4546947, -5454730, -4469119, -1306929, 1345160, 4590684, 4896247, 3706180, 3069283, -1787432, -5662812, -3634167, -2975922, -1682026, 1709180, 1987138, 2051158, 2992906, 2541697, 1347277, -1851663, -3576116, -2669942, -3228265, -1207676, 2879336, 2753965, 2798422, 2580583, -431116, -964066, -1121258, -2648630, -2238184, -1691490, -81161, 2157832, 3138116, 4578665, 2615323, -2872383, -3491093, -3155130, -3707286, 116031, 2544676, 2220719, 3059942, 2686677, 1213353, -1056141, -3355835, -2515556, -2863306, -3071508, 1273027, 3470309, 3222292, 3665293, 636688, -1960990, -1546796, -2204333, -2160771, -1598259, -1119842, 1127320, 2006274, 2658328, 3339357, 178364, -1590809, -1109731]
1206a109731j862914R95223B88321e0746G52415R91938p2902M64278F91811f73302
1217a564522j974570J299555D63883P53371J786863q79420h35253A24943a93417
1227a390809K27658k4305d56048F20190N42083J556212j127451i49432K11376
1236g38056j754625j153346C74675J670473k48334j250E16848k29664b83143j150240
1246a433383N68626p11738j42854E85282O26563R38416K45097E8599b94033j2099
1256c06132j700193R01387c64499o65615d5179C95265R16752P36150q53476K34943
1266A429634a18145l123121J274256d88944q88088B14127J152181L92633Q89292
1275B648233j307452a65240j493349j378419J405183g99303a27197B428307l30357
$$ y = [-1109731, -2972645, -1977422, 288321, -50746, 752415, 1744353, 1671451, 2135729, 691811, -673302, -1564522, -3539092, -2239537, 463883, 1217254, 3004117, 2124697, -835253, 124943, -193417, -1390809, -1163151, -1187456, -456048, 620190, 1162273, 2718485, 1591034, -949432, -738056, -2492681, -3646027, 374675, 2045148, 1796814, 1795564, 516848, 287184, -283143, -1433383, -864757, -1576495, -1719349, 585282, 1211845, 2150261, 2395358, 58599, -294033, -306132, -2006325, -1104938, -364499, -1030114, -45179, 395265, 1312017, 2048167, 1194691, 1429634, -118145, -3241266, -1967010, -488944, -1377032, 214127, 1366308, 1758941, 2648233, 1340781, -165240, -1658589, -3037008, -1631825, -799303, -127197, 2428307, 2097950]
1284B097950F78576j06829a006877k49683A33391e20773R3113a3164k07163H45802
1295D14457a14373E38243f51932L13390I81262b71928Q16o1296j238293g3274
1306A009846B52967O31421j6546a18871o94147j053996b26183D08669e53911A422699
1317A260011g32172F83102j74182a654042K83512b08155H56592n609b32663E29458
1328B06990g16949F10422B89098c78488C71306i12226m3251C28545b63399C59269
1339A134719D25801p2815Q4667M5810F7318b031826K89340f59305p67526A349775
1350C886862A325172A67891K74794e67485r51533n67831Q26567e07131k06995
1359g14126A795513R59641A161611Q76193G39462b645290K76889Q02152M61351
$$ y = [2097950, 678576, 571747, -1006877, -1256560, 133391, -520773, -427660, -13164, -220327, 845802, 414457, -114373, 538243, -651932, -338542, 981262, -271928, -271112, -332408, -1570701, -73274, 1009846, 252967, 884388, 867842, -118871, -813018, -1867014, -226183, 408669, -553911, 1422699, 1260011, -732172, 683102, 508920, -1654042, -1370530, -208155, 856592, 850983, -232663, 529458, 206990, -716949, 610422, 289098, -378488, 371306, -912226, -955477, 328545, -263399, 359269, 1134719, 425801, 352986, 437653, 483463, 67318, -2031826, -1742486, -659305, -1426831, 1349775, 3886862, 1325172, 167891, 442685, -567485, -1519018, -2086849, -1260282, -507131, -714126, 1795513, 2755154, 1161611, 2037804, 739462, -2645290, -2368401, -1566249, -1104898]
1368a104898B64998O7548L59744P80230K9533O37354B75809a761944P32136j174169
1378b203977k52333F23779J96283C88954J531183l52088m19118k97968e36303
1388a640692j437326P71697C1703O01656K157971J120022C8332a171817c63773
1398a802362L32658c12274k36206e3075A416591J250896r18244a132390L89098
1407g43292k50946k258950d06309B364617j097981j39632D15759a023013d81016
1417a95942D00825c92963j386869e89355A26182J95251K095635A171920d77610
1427C50588a010644o53941f5756m42752o63259A35493J460676R05287j118503
1436A382953o52223k46216c387584l16759f3762E3148J019855J649650A130050
$$ y = [-1104898, 264998, 332546, 692290, 1472520, 1502053, 2139407, 275809, -1761944, -1029808, -2203977, -2456310, 623779, 820062, 388954, 1920137, 1568049, 1148931, 850963, -536303, -1640692, -3078018, -2306321, 31703, 633359, 2791330, 3911352, 38332, -1171817, -363773, -1802362, -1469704, -312274, -548480, -53075, 1416591, 2667487, 1749243, -1132390, -743292, -994238, -3253188, -406309, 2364617, 1266636, 1127004, 415759, -1023013, -481016, -195942, 400825, -392963, -1779832, -589355, 126182, 321433, 2417068, 1171920, -477610, 350588, -1010644, -1664585, -65756, -508508, -1171767, 135493, 1596169, 2501456, 1382953, 730730, 484514, -3387584, -3704343, -63762, 53148, 1073003, 2722653, 1130050]
1446B56212J13829g6075j049447j536820J233016D98967k35244J767336O98318
1455B729377h5840m05415l95936j545887d76300A126085C70889h802j68072F51023
1466I37974a58247G74622h28787k034826c24213F61459B96547J628149q70409
1475A054287b26066g2042k52736q6073o35653n58851d25678l4976E91949K445521
1485C037470j166020o15939m68162b948560n82887i82232K54434c84A027174J285359
1495B312533O89815A477581D98963f06734l292825P97323h62763k25048A163888
1505C158302p84237n97349D34124h31464m28498j160633M89067h13632c12979
1515A920639M69990A050611N35264a88021j607786c02754l67775q31554O68098
$$ y = [256212, 370041, -76075, -1125522, -2662342, -1429326, 498967, 263723, 2031059, 2729377, -85840, -491255, -887191, -2433078, -476300, 1126085, 370889, -8802, -176874, 651023, 937974, -158247, 774622, -828787, -2863613, -324213, 661459, 296547, 1924696, 1054287, -226066, -72042, -324778, -410851, -1046504, -1605355, -425678, -460654, 591949, 3037470, 1871450, 1255511, 787349, -2948560, -3531447, -982232, -727798, -384, 1027174, 2312533, 3002348, 1477581, 498963, -606734, -3899559, -3102236, -862763, -1087811, 1163888, 3158302, 2374065, 1776716, 434124, -831464, -1259962, -2420595, -1931528, -813632, -312979, 1920639, 2390629, 1050611, 1585875, -188021, -1795807, -302754, -670529, -1502083, -833985]
1524h33985J34041G86303J186992k34319J06655a73278j306742P24282j502862
1533b258600M84549I53361r3816L20158P02766G16011J62054d6423k009897l36701
1543b393021K74827C21198K078081j093545O93033l34874a382279P5858L27617
1552i78804q61352e39263D17551M51250P78126G81089n6714C13580a840773g74481
1563e68238n18262B91941D6400b22992I13238C07381M19774J137000c37493j374412
1573a711905O0969N57160A84046d26513F5490J783652B75575L69359J123665g53017
1584a697200Q38388p58769O96747I15891J365188O320b05940j001049e83029p29753
1594a312782E42072P14012d99668A39702a19296o33769G57251k46430e00856a01692
$$ y = [-833985, -699944, 786303, 1973295, 1738976, 1845631, -173278, -1480020, -755738, -2258600, -1774051, 953361, 859545, 1179703, 1882469, 716011, 878065, -46423, -2056320, -2393021, -2118194, 321198, 2399279, 1305734, 1998767, 1663893, -1382279, -1306421, -978804, -1840156, -539263, 417551, 868801, 1646927, 781089, 724375, 313580, -1840773, -774481, -568238, -1086500, 291941, 46400, -222992, 913238, 307381, 727155, 1864155, -337493, -1711905, -1650936, -1093776, 184046, -426513, 65490, 1849142, 275575, 644934, 1768599, -753017, -1697200, -858812, -1617581, -920834, 915891, 2281079, 2287399, -205940, -1206989, -583029, -1312782, 542072, 1256084, -499668, 139702, -119296, -753065, 757251, 510821, -500856, -101692]
1605c96659E95020N16215A17377M29960h84125j305816c1300o8206B92957J863491
1615B156448E34810a065661d72197a67984B14872b27843o08901L68303j719E83247
1626A717829h75035Q8230A067538h83257K68024A385477D35328d33466k69652
1635g03118L45257B42805I4096J082357j36882a830574g45810A030284F4783Q48221
1645I13004o6858i98505d49256B8033M88527M58330g93231l46460L88586A0075
1656B303140p13310A53315Q99889a793238j993352g43468B67172k8191J347931
1665A586912n32029l77970B12965N90147j83158b916122n68368c36082j59116
1674d95198E47060K769432j247574B50692c63466r81960J64282M6688d32788A03527
$$ y = [-396659, 595020, 1111235, 117377, 547337, -884125, -2189941, -31300, -99506, 292957, 2156448, 534810, -1065661, -472197, -167984, 214872, -227843, -836744, -468441, -470160, 583247, 1717829, -875035, -786805, 1067538, -883257, -615233, 1385477, 435328, -433466, -703118, -357861, 242805, 94096, 1176453, 1039571, -1830574, -745810, 1030284, 64783, 913004, 846146, -998505, -449256, 28033, 516560, 974890, -793231, -1139691, -751105, 10075, 2303140, 1589830, 153315, 1053204, -1793238, -3786590, -743468, 267172, 238981, 1586912, 1054883, 676913, 212965, 803112, 619954, -2916122, -3484490, -336082, -495198, 547060, 3316492, 2068918, 250692, -363466, -1345426, -1181144, -1134456, -432788, 103527]
1685a040967C98044J696703G17388Q18520j53706a466340L60392e33756q43660
1694a377416d64070A15283K77322J111423O86610M82474A89096b499135R74416
1703a524719m32111n9914A199084Q20381m18975N64619E48866a348699J8452k08289
1713a538536m0833n86739a57621C162700n59211j070421r9749b426669j288838
1722c715507a288704L53908c24551A362506M61468n87772C78392N13490K63437
1731A155319a689884n35419P94229j100092c40169B322954p6308O29008q61907
1740B013747b17853n63058o83867o53255n00057M61020H94741J626349K80545
1749B801635J650775B016919a546703K27838j677858j576070a799807A034502
$$ y = [-1040967, 398044, 2094747, 717388, 1535908, 1382202, -1466340, -1105948, -533756, -1377416, -464070, 115283, 392605, 1504028, 2190638, 2673112, 189096, -2499135, -1524719, -1956830, -2016744, 1199084, 2019465, 1600490, 2165109, 548866, -1348699, -1330247, -1538536, -1579369, -2166108, -157621, 3162700, 2603489, 1533068, 1433319, -2426669, -3715507, -1288704, -934796, -324551, 1362506, 1823974, 1236202, 378392, 891882, 1155319, -1689884, -2225303, -1431074, -2531166, -340169, 2322954, 2246646, 2875654, 2013747, -217853, -780911, -1464778, -2118033, -2618090, -2157070, 894741, 2521090, 2801635, 4452410, 2016919, -1546703, -1318865, -2996723, -4572793, -1799807, 1034502]
1758B476389M66728K18669j01950c97743k811935J88895p11837J017890A483321
1768B176144k7039J089043A544551A04629a281429j683581k59528j43967a002115
1778B223983O30039J103952p10209h25399j111782j66947j642809J204531d32983
1788G19093J191920P69678J309630n32518B4269b197450k236971r53980a999051
1798G27022J080332K827646O1332j810165A346657a543211k527796p13157L57712
1807d426452a698506H73968L114096K850581k393507H61367g55366l651737j460790
1816e867893J841686J747711D63186K656277J544134N83665B374919g68836j898854
1825b667690k499233R64695a419530f61269A607712J860261l07818K09994j506103
$$ y = [2476389, 2943117, 3161786, 3059836, -397743, -3209678, -3020783, -3732620, -2714730, 1483321, 2176144, 2149105, 3238148, 1544551, 104629, -1281429, -2965010, -3224538, -3368505, -1002115, 2223983, 2854022, 3957974, 3247765, -825399, -1937181, -2104128, -3746937, -2542406, -432983, 719093, 1911013, 2680691, 3990321, 3457803, 24269, -2197450, -4434421, -5388401, -1999051, 727022, 1807354, 4635000, 4696332, 2886167, 1346657, -1543211, -4071007, -4784164, -4426452, -1698506, 873968, 3988064, 6838645, 4445138, 861367, -755366, -4407103, -5867893, -4026207, -2278496, 463186, 3119463, 4663597, 5247262, 2374919, -768836, -2667690, -5166923, -4202228, -1419530, -661269, 1607712, 3467973, 3160155, 3370149, 1864046]
1834A864046a298249j480573j517521j60329K144080F66377L908985O79356k344922
1843B909796r49154c77116k845765Q7061q87301N52231c34696B722556K412315
1852E134871O65519k191077C65541d172966k341549J855449J863404F81529L853781
1861D535310k52406o74843k87808A01186b505027j449590j128937J056094a693974
1871B237657L262996r22125j510299A462251b175545j421675n33807n55107a896996
1881G28224J743528K385705P4467j663709D16621c309515j656933l398J652474
1890c317372F57853J377277P55141L158905j276632I57222a362224k945807j888998
1899f197029J136545a523507C058923J715153L22660m35220I18531b305138o65887
$$ y = [1864046, -1298249, -2778822, -4296343, -4456672, -2312592, 666377, 4575362, 5254718, 2909796, 1960642, -377116, -3222881, -3135820, -4023121, -3470890, -334696, 2722556, 5134871, 5800390, 3609313, 365541, -4172966, -6514515, -4659066, -2795662, 681529, 4535310, 4282904, 3608061, 3320253, 101186, -2505027, -3954617, -5083554, -4027460, -1693974, 2237657, 5500653, 4578528, 3068229, 1462251, -2175545, -3597220, -4131027, -4686134, -1896996, 728224, 2471752, 4857457, 4931924, 3268215, 416621, -3309515, -4966448, -4969846, -3317372, 657853, 2035130, 2790271, 5949176, 4672544, 957222, -1362224, -4308031, -6197029, -5060484, -1523507, 3058923, 4774076, 5096736, 4661516, 918531, -2305138, -2971025]
1908b971025j765411O4148a919006B81304L317813K048376n80225k038547a361755
1918d986437o21207R95363a086503A742438L34541K332446N08099A697203B64423
1928a655056l093466l05715J393596a146261B107290K382009J591170k419921
1936C660548a94719n48166k479931k330389J749090J377619d54026C904451K092802
1945E997253m70770k261379b27090l038930l064418J70610b286680d60302B355794
1955F436170o24030k506035A141138b782073k709220l71432J749419a59681B862511
1965E170095K50520B111194E05593h91449l057299j52441P26743M43411A017356
1975D158817r6151j61549j470101c76664l123340j676880K402891J251153L07573
$$ y = [-2971025, -4736436, -4672288, -1919006, 281304, 3599117, 5647493, 5067268, 3028721, -1361755, -4986437, -5607644, -4612281, -1086503, 1742438, 2076979, 4409425, 4917524, 1697203, 264423, -1655056, -4748522, -5054237, -3660641, -1146261, 2107290, 4489299, 6080469, 3660548, -194719, -742885, -3222816, -5553205, -3804115, -2426496, -454026, 3904451, 5997253, 5526483, 3265104, -227090, -3266020, -6330438, -6159828, -2286680, -460302, 2355794, 6436170, 5812140, 3306105, 1141138, -2782073, -5491293, -5862725, -4113306, -159681, 2862511, 5170095, 5420615, 2111194, 505593, -891449, -3948748, -4101189, -3374446, -2931035, 1017356, 4158817, 4062666, 3901117, 2431016, -376664, -3500004, -5176884, -2773993, -1522840, -1215267]
1984a215267B857148J332866j177899P90558j856509b298069k792078l99528J956836
1993c532839i46778B434849L658838q55326B568594j018589b089057k919045M42561
2002d565541K19651a802901B382762J679892J267368m74365A902441a560593l461807
2011e022400l07469J968659Q81458H58571K889181l0839R50909p82877e76518
2021c253022j029117k71814J682590h60336B403579J735616p27285L36553A580019
2031b021683m61343j511232j346256b243687A174684K185823J557380p03251j704567
2040B510069a052818k509875M30639o10014L32986C03897J548593J738849K030045
2049E621384j841618C19542b425881k483712K56466J401619f55645C261772Q71152
$$ y = [-1215267, 2857148, 4190014, 3012115, 3802673, 1946164, -2298069, -5090147, -5489675, -3532839, -946778, 2434849, 6093687, 5238361, 2568594, 1550005, -2089057, -5008102, -4565541, -4345890, -1802901, 2382762, 4062654, 5330022, 4855657, 1902441, -1560593, -5022400, -5329869, -3361210, -2479752, 858571, 3747752, 3716913, 4667822, 3884945, -576518, -3253022, -4282139, -4553953, -2871363, -860336, 2403579, 4139195, 3411910, 3748463, 1580019, -2021683, -2483026, -3994258, -5340514, -2243687, 1174684, 3360507, 4917887, 4214636, 2510069, -1052818, -3562693, -3132054, -3742068, -3409082, 303897, 1852490, 3591339, 5621384, 3779766, 319542, -2425881, -4909593, -4653127, -3251508, -655645, 3261772, 4132924]
2058D132924j72680j049655a60034j041240j031091k752929J210627g69836I07274
2068C355284R08604j182343A233561a345726n38927r28116r80268a362767C56244
2078B34827K611835J067471j511009A033814a265636j567785m87045N2091h58424
2088A075729O66193J669825l20243j296294H52440b508123k021065J250052J336568
2097a942568H56880K377001l29136l23014I23056h80511p34306j106861O55026
2106b066652a43904l13860I10306J829890p85285l86415c41760k343771P09794
2115a975737Q06796a20523A198715l34360k7910m3052a17632G79198A17180a916434
2126a120203j52060J43868A488511N10811l08645l48881d80263l31366q85317
$$ y = [4132924, 3960244, 2910589, -160034, -1201274, -2232365, -4985294, -3774667, -769836, 907274, 3355284, 4263888, 3081545, 1233561, -1345726, -1884653, -2812769, -3793037, -1362767, 356244, 234827, 2846662, 3914133, 2403124, 1033814, -1265636, -2833421, -3320466, -3268375, -858424, 1075729, 1741922, 3411747, 3091504, 1795210, 852440, -2508123, -4529188, -3279136, -1942568, 856880, 3233881, 2904745, 2581731, 923056, -880511, -1614817, -2721678, -2066652, -143904, -457764, 910306, 2740196, 1954911, 1568496, -341760, -2685531, -1975737, -1168941, -120523, 1198715, 864355, 836445, 793393, -117632, 779198, 117180, -1916434, -1120203, -1272263, -1128395, 1488511, 1999322, 1690677, 1341796, -480263, -811629, -1696946]
2135a696946n66287e42592L5220K12938A987012N42478K55313j000464a814552
2145b900398L89665K2837d47803A177724Q55515Q34519j014316q81129e7770k264728
2155b322498M4368L45424n63904B96811K450149m12461o5404H42606e57710m86504
2165a044214o82371N84289L4566l88068D50225R54402K77504J153165A157705
2175a211332R9748n49553q4327e11607a21741G36590K05977J39802J103891j090924
2185A095336e9702n64301k552247Q9415b04675A003827R98167K48959G17253R5563
2195H12816E8270a301714n2985l96113P54482g7061B53233K088646L85660B45674
2206D442h41643j526683a026295C04148P0660E3966c2504H77636k66908a21734
$$ y = [-1696946, -2263233, -542592, -507372, -294434, 1987012, 2529490, 2784803, 1784339, -1814552, -2900398, -2510733, -2487896, -447803, 1177724, 2033239, 2867758, 1853442, 972313, -57770, -2322498, -2278130, -1932706, -2496610, 296811, 2746960, 2334499, 2269095, 842606, -557710, -1044214, -1726585, -1142296, -1107730, -1495798, 450225, 1404627, 1682131, 2835296, 1157705, -1211332, -1111584, -1661137, -1745464, -511607, -121741, 736590, 942567, 1082369, 2186260, 1095336, -59702, -624003, -3176250, -3086835, -204675, 1003827, 2001994, 2250953, 717253, 812816, 58270, -1301714, -1354699, -1750812, -996330, -77061, 253233, 2341879, 2727539, 245674, 4442, -841643, -2368326, -1026295, 304148, 374808, 53966, -32504, 877636, 610728, -121734]
2217A245825B56288a705781d10060c6575o94976K87106Q1397C25770P80685k9167
2227A077288L18166D79929h61365l944j140855N25616F92601p5855L00881O02062
2237A519689i1831A30335Q20727c88271r62061J86926a45470B26708a77509H19952
2248A047408i22043I2654J259254A2802L97309A91214a703506k57666P99947C20503
2259A381928J53001P04546I81690a274824d79988k21386j493414a030647c04586
2269A04100J925286K55878r05231a46700r70201J51905o20471O8579F56339J72467
2279H28806k01308O12053B72554Q6760O12208g03795n01245N17633k20825b12397
2290A50689M85095M38743C25182O73868K08348a476570J2885f38916j087999d56055
$$ y = [1245825, 256288, -1705781, -410060, -36575, -731551, -444445, -363048, 325770, 1106455, 1077288, 1395454, 479929, -861365, -865309, -2006164, -1480548, 692601, 616746, 917627, 1519689, -91831, 130335, 951062, -388271, -1350332, -1163406, -145470, 226708, -177509, 819952, 1047408, -922043, 92654, 1351908, 12802, 410111, 191214, -1703506, -1961172, -1161225, 320503, 1381928, 1534929, 2239475, 981690, -1274824, -479988, -701374, -2194788, -1030647, -304586, 104100, 2029386, 2285264, 1380033, -146700, -1116901, -964996, -1585467, -1516888, 656339, 828806, 627498, 1239551, 272554, 359314, 971522, -703795, -1205040, -687407, -908232, -212397, 150689, 635784, 1074527, 325182, 999050, 1207398, -1476570, -1463685, -638916, -1726915, -456055]
2301A520511J72352H27891B88655L48011b83998j675660R78466b10174r75477
2310a185651D81614J151468j04263L46461E18467a340212p37938J91944d49182
2320I24600m19380L72381q7241l39782L97327e32123n80323a89406j362976L30880
2330a221502H74986M69993j13792m58427b83787k87547k99974h796F77846f71547
2341f47439D94575d33567C81910J172381B13612d42704r0951k08800L00957J32638
2351c08860F8611K79635C2282Q37869j65015h54230J78645n7535p76237a35637
2362A246350P58382j02109b17553r64259j38140k26776f32713e1186H2823J428192
2372A511015K84118m22817j33513i97097j192169K74893l14639c11513B129324
$$ y = [1520511, 1692863, 827891, 288655, 636666, -283998, -1959658, -981192, -210174, -1185651, 481614, 1633082, 1528819, 1875280, 518467, -1340212, -2078150, -1886206, -449182, 924600, 505220, 877601, 790360, 450578, 847905, -532123, -1112446, -189406, -1552382, -1221502, 874986, 1344979, 1231187, 772760, -283787, -571334, -871308, -8796, 677846, -671547, -647439, 494575, -433567, 381910, 1554291, 213612, -442704, -533655, -742455, -441498, -308860, 68611, 348246, 32282, 870151, 705136, -854230, -675585, -733120, -1509357, -135637, 1246350, 2004732, 1902623, -217553, -1181812, -1319952, -1546728, -632713, -51186, 82823, 1511015, 1795133, 1372316, 1238803, -997097, -2189266, -1914373, -2229012, -311513, 2129324]
2382B339109r06446B7845d37253a30212p63915L18596b53142j690372L74182B83663
2393A380805J164060o01386A82446f42885j121237k4427P95905l21242d96717
2403G03847O57860J038627q8881I71160b94428k726483j132520a633247A55617
2413A581977J102865n98585o61620B64472i10438l87888j089444M45285a72179
2423B85470J124395J507935j383772A78102b82248j382172M21492L26693r44c32384
2434a18029A562054N76014r17563j86503a72111k570973N79660f78272J79250
2443d99022B95343L25244L99179N21751l26540l05533e41384j957120L02307R4511
2453b101686Q65542A874167R05909o80745n18353c79811j116382N96025k01466
$$ y = [2339109, 1432663, 27845, -437253, -130212, -894127, -575531, -253142, -1943514, -1569332, 283663, 1380805, 2544865, 1943479, 182446, -642885, -1764122, -1788549, -992644, -1313886, -496717, 703847, 1361707, 2400334, 2311453, 971160, -294428, -3020911, -4153431, -1633247, 155617, 1581977, 2684842, 2086257, 1424637, 264472, -910438, -1298326, -2387770, -1942485, -172179, 285470, 1409865, 2917800, 1534028, 178102, -282248, -1664420, -1242928, -916235, -917179, -332384, -118029, 1562054, 2138068, 1220505, 1034002, -172111, -2743084, -2163424, -678272, -499022, 295343, 620587, 1019766, 1541517, 1214977, 909444, -541384, -2498504, -2196197, -2101686, -1236144, 1874167, 2780076, 2099331, 1580978, -379811, -1496193, -900168, -1101634]
2462a101634m57248R0037c7760A765297k49488M71924M52530f50258j559426Q41332
2472a368352k46833g61761I87790J02839j34916D09879J03714K42813e25832e9293
2483I7632a604111P44071B05244c86421D30614L76624C34746N54045k53247b41621
2494a249457l56625d10894a18371n12321A061788j0730a43920F27419A802a127850
2505a98538k60856k50066G9112O92325M66277h3267p42830c83265m84828G4020
2516B197969F54911b33851A71169a537435P6747D06143P66237k75843D11095M57822
2526H68917l41074a384537d91986C50149a216952e97422I73599D81669M44498
2535I26167K68866b6326j092703l69376d14628D00583c51254B94198L18571a57111
$$ y = [-1101634, -1558882, -1468845, -37760, 1765297, 1515809, 1987733, 2440263, -650258, -2209684, -1368352, -1615185, -761761, 987790, 1090629, 955713, 409879, 513593, 756406, -525832, -59293, 97632, -1604111, -860040, 205244, -386421, 430614, 807238, 334746, 888791, 635544, -241621, -1249457, -1606082, -410894, -118371, -630692, 1061788, 1051058, -143920, 627419, 1802, -1127850, -198538, -459394, -709460, 79112, 771437, 1237714, -83267, -826097, -383265, -868093, 74020, 2197969, 654911, -233851, 171169, -1537435, -1460688, 406143, 1172380, 896537, 411095, 868917, 527843, -1384537, -491986, 350149, -1216952, -597422, 973599, 481669, 926167, 1195033, -26326, -1119029, -1488405, -414628, 400583, -351254, 294198, 612769, -157111]
2546F28018D317g38644E50734H3227a107419a59706r9856k78091a27932C89794
2557A235917n33734k47840M01089a755835o95843b54831J14670C59150J623744
2566A982894p29185D4410b78403B07273K78555a062586l79643e83186l21665H48749
2577B619965A252292E85243D5981a724009K82820a82850H96643J87456b61194
2587f80196a78322C6313J115421m36952f78625K69546l5833k25195F84930k02170
2597D82760c82767J37163q27122d82826G73343M23363k00039e74494n03051a6277
2608i21446L09597A005346b95280n64180B58986M60065M4997j37922B10560K8501
2618B39061g30643J49834a5473j548220M67988H78296J88618J069238J12509I01046
$$ y = [628018, 4317, -738644, 550734, 83227, -1107419, -159706, -259562, -537653, -127932, 389794, 1235917, 702183, 454343, 855432, -1755835, -2451678, -254831, -140161, 359150, 1982894, 1253709, 44410, -278403, 207273, 485828, -1062586, -1442229, -583186, -904851, 848749, 2619965, 1252292, 585243, 45981, -1724009, -1441189, -182850, 896643, 1084099, -261194, -680196, -178322, 36313, 1151734, 714782, -678625, -409079, -444912, -670107, 684930, 482760, -382767, -245604, -1072726, -482826, 773343, 1196706, 996667, -574494, -1077545, -16277, -921446, -611849, 1005346, -295280, -859460, 258986, 719051, 764048, 626126, 210560, 239061, -730643, -580809, -15473, -1563693, -1095705, 878296, 1066914, 2136152, 2248661, 901046]
2629g7152k211650j113937a685890a72500G28172R67560N7555M95413o67115A43824
2640g26504k389506j039731a784550A57835J522227J929738p46856I67830i69805
2650a661063N76245n34745l54221e99747m62615B56068K553619J05807l51998
2659B563496A006145b121961j364421M36542J168253a02549I43526J085821J079563
2668C108910m04257q80301A86799b753023n97754k21796O15623F15689K862353
2677C478042Q65957l02841A818494f68324j504125j435441K56543Q66991f76585
2687B811296O80965m56747K48839E36426b302549m86858l08928L01747J337053
2696a459535C69491K118799M48516L55726m55566d92882k117353l75993j125282
$$ y = [-77152, -2288802, -3402739, -1685890, -172500, 728172, 1695732, 1753287, 2248700, 1581585, 143824, -726504, -3116010, -4155741, -1784550, 157835, 1680062, 3609800, 2862944, 967830, -969805, -1661063, -1084818, -1619563, -1973784, -599747, -1062362, 256068, 2809687, 2915494, 2563496, 1006145, -2121961, -3486382, -3049840, -1881587, -102549, 943526, 2029347, 3108910, 2704653, 1824352, 186799, -2753023, -3350777, -3572573, -2956950, 615689, 3478042, 4343999, 4041158, 1818494, -668324, -2172449, -3607890, -3351347, -2484356, -676585, 2811296, 3492261, 3035514, 3284353, 536426, -2302549, -2789407, -3098335, -2796588, -1459535, 369491, 2488290, 2936806, 3292532, 2836966, -492882, -2610235, -2986228, -4111510]
2705d111510J248866C91440J290418J201763L506r56854m23685g4161k146301
2714b220462j601947l88580a597759A002047J330985K351875n12198H38464h93556
2724b771024j368174J325777h54022G60175Q25936J179575J126683A773778g85738
2734a227232k135688q23995a309788F57881J323551J496358n04433A104703g05251
2744b029767n86310o42177a410806A132581J11658P50976J187005A253597e2518
2754f50962j974156o19925R89347g82442D46431J702265K076944k09778D47337
2764a421210j263150j639188J711371e38956B47799K462889J365508p71910j194423
2773B109863A75006b307283k531919l16298b124689D43480K593431L013419j496915
$$ y = [-4111510, -2862644, 391440, 1681858, 2883621, 2887127, 1930273, 1506588, -74161, -2220462, -3822409, -4210989, -1597759, 1002047, 2333032, 4684907, 4172709, 838464, -893556, -2771024, -4139198, -2813421, -854022, 760175, 1586111, 2765686, 3892369, 1773778, -785738, -1227232, -3362920, -4186915, -1309788, 657881, 1981432, 3477790, 2973357, 1104703, -705251, -2029767, -2616077, -3258254, -1410806, 1132581, 1244239, 1995215, 3182220, 1253597, -52518, -650962, -2625118, -3245043, -2255696, -782442, 446431, 2148696, 4225640, 4015862, 447337, -1421210, -2684360, -4323548, -2612177, -538956, 247799, 2710688, 4076196, 3304286, 2109863, 175006, -2307283, -4839202, -5155500, -2124689, 443480, 3036911, 6050330, 4553415]
2782D553415I88756e74106k336352j730876J063726a583829a05893A177344K301555
2791C478899J547041k253185C34019a084854l031117p92833K343450a167601I23650
2801C632479N01662r12227A568129b28199k034500k608119K48199K061000f32543
2811C355506K015723j481776p91057A211318b843458j899134k88913R42572a392173
2821B215212L321077O52572k150609A579064b801000l136722J136410J286484
2829c514828J501023A809178K214186K46713j877j167812B99187c764272k292340
2838f056612P67631J518600B02325M764693k3305j243275n02155D59103b518862
2848c669836k60490M78794Q94053A15816L867113J249720J55556k259320a756721
$$ y = [4553415, 988756, -574106, -2910458, -4641334, -3577608, -1583829, -105893, 1177344, 3478899, 5025940, 2772755, 334019, -1084854, -4115971, -4908804, -2565354, -1167601, 923650, 3632479, 4134141, 3221914, 1568129, -228199, -2262699, -4870818, -4622619, -2561619, -632543, 3355506, 5371229, 3889453, 3098396, 1211318, -2843458, -4742592, -5031505, -4088933, -1392173, 2215212, 5536289, 6188861, 4038252, 1579064, -2801000, -5937722, -4801312, -3514828, -2013805, 1809178, 4023364, 4270077, 4268200, 3100388, 299187, -3764272, -6056612, -5288981, -3770381, 202325, 4967018, 4943713, 3700438, 3198283, 459103, -2518862, -3669836, -3930326, -3451532, -2557479, 115816, 3982929, 5232649, 5388205, 3128885, -1756721]
2858d378772n44711K31862a883068H18189J575423J764593L76746j654194G32983
2868b273270j893124j276387J238494A22455K802462R47680J444648j775116a64563
2878b227594j555250o09547R65727a260198B106325J718174P19462m41301E67842
2888b880563l80495m17114N56525g79804F98159J937297J132345n26849j008284
2897B232668I2317b408194j609772o70529K207628G22244J652137J622800k58730
2906C738451A675962G68716i66552k361227l10789K25074J028606G71996L170282
2915C942278J800655j336568A045494a513437k873334j216334K681753f83286
2924A116938K776201M75874j403356A265212f22668j914868j902294q6121a413173
$$ y = [-4378772, -4923483, -4691621, -1883068, 818189, 2393612, 4158205, 4534951, 2880757, 732983, -2273270, -4166394, -5442781, -4204287, 122455, 2924917, 3872597, 5317245, 3542129, -164563, -2227594, -3782844, -4392391, -3426664, -1260198, 2106325, 3824499, 4543961, 4102660, 567842, -2880563, -3261058, -3678172, -3121647, -779804, 698159, 2635456, 3767801, 3240952, 2232668, 92317, -2408194, -4017966, -4688495, -2480867, 722244, 2374381, 3997181, 3738451, 1675962, 768716, -966552, -3327779, -3638568, -3413494, -2384888, 771996, 3942278, 5742933, 4406365, 1045494, -1513437, -4386771, -5603105, -2921352, -683286, 1116938, 3893139, 4369013, 2965657, 1265212, -622668, -2537536, -4439830, -4525951, -1413173]
2934A020971J794927J454730j102103A441193E1192b625410p25692N02124L37538
2943b511440d23909A745211R67154P92672o89747A258811a212133k277657N61064
2952b928726J02340J70448F49847K939316J16467R9252j043776d55056l136189
2961c591245j382701J338911J688855B45422L544681L11424j227079n0600E06466
2971b817686q72257l92504J040273d88352A898992K426270J64706j667424C34845
2981b727421q28328R25620j89577a250327A337299R36694Q52398L99911A556894
2991d93971j650908j174236Q756J046026E91446J860997l69221J206248m91498
3000B797972c43653r99766p79270j583746R86967b17734A240355J162927P86061
$$ y = [1020971, 2815898, 4270628, 3168525, 1441193, 51192, -2625410, -3351102, -2848978, -2511440, -423909, 1745211, 2712365, 3505037, 2815290, 1258811, -1212133, -3489790, -2928726, -2826386, -2655938, 649847, 3589163, 3705630, 3804882, 2761106, -455056, -3591245, -4973946, -3635035, -1946180, 245422, 3790103, 4101527, 2874448, 2823848, 506466, -2817686, -3689943, -4082447, -3042174, -488352, 1898992, 4325262, 4489968, 2822544, 334845, -2727421, -3555749, -2630129, -2819706, -1250327, 1337299, 2273993, 3126391, 3526302, 1556894, -493971, -2144879, -3319115, -3310359, -2264333, 591446, 2452443, 2083222, 3289470, 2797972, -343653, -1343419, -2122689, -3706435, -2719468, -217734, 1240355, 2403282, 3189343]
3009C189343j52832E40268a803191O65982j694719j175917a351666G84743J486603
3018B271346J669224o55545A019285a149159j677452m45118L49567i24923A758303
3028A830045J88918Q29173A138135b8938q15061k416112l70526a147187C20193
3038A506100R71946K08436A272547a172713e39591J51798j993146P47875e98038
3048a198989G71599K462171m99078j022857C01268a286431j794428j73486i25541
3058A19202L12298K042057P0074j082576m1400f65929k568457M62463J258597
3067a513326b23624A019043J454566L78344G32108e39432R9875j491055L19346
3076a611266b15865n23299a81041A740839J6378H25901I5258f98236m86954j34262
$$ y = [3189343, 3036511, 540268, -1803191, -1137209, -2831928, -4007845, -1351666, 784743, 2271346, 3940570, 3285025, 1019285, -1149159, -2826611, -3271729, -2922162, -924923, 1758303, 1830045, 2018963, 2848136, 1138135, -28938, -843999, -3260111, -3630637, -1147187, 320193, 1506100, 2478046, 2686482, 1272547, -1172713, -539591, -387793, -2380939, -1633064, -598038, -1198989, 771599, 3233770, 2734692, 1711835, 301268, -1286431, -3080859, -3254345, -925541, 119202, 431500, 2473557, 2543631, 1461055, 1419655, -665929, -3234386, -2771923, -1513326, -223624, 1019043, 2473609, 2851953, 732108, -539432, -439557, -1930612, -1611266, -215865, -739164, -181041, 1740839, 1757217, 825901, 95258, -698236, -1185190, -1319452]
3086a319452b52860D92248c81056B31997N45103D2424J388948J78378h84310o58028
3096a542338L90807l11395e53978I25934J245336q22824i416D39146b51941j231013
3106a482954b69149m29971j341764h475A921842n3206l93474D97556f00634j046097
3116a646731j37395d82586d7297C95535J028555B09203e2887A301244C09063f17801
3127e71232o71942M77459A16575O58228J42053C4904R11h6225o57987H9340P45368
3138H34708h00575L23246C44720b13959E7264N57976B55929f2947p8369C27017
3149a55592n47396C57461c31146j099292F95405P87650B26491E8830e30242m83186
3159a013428d28907B37079O14378C27108b6467F36241b89927o53639G6533b85917
$$ y = [-1319452, -252860, 492248, -381056, 231997, 777100, 42424, 1431372, 1609750, -884310, -1542338, -1151531, -1462926, -553978, 925934, 2171270, 1348446, -9416, 439146, -251941, -1482954, -269149, -699120, -2040884, -8475, 1921842, 1868636, 1475162, 497556, -600634, -1646731, -1784126, -482586, -47297, 395535, 1424090, 209203, -52887, 1301244, 309063, -617801, -571232, -1243174, -765715, 116575, 774803, 916856, 34904, 35815, -86225, -744212, 89340, 834708, -800575, -477329, 344720, -213959, 57264, 615240, 255929, -62947, -141316, 327017, -155592, -702988, 357461, -331146, -1430438, 695405, 1483055, 226491, 58830, -530242, -1013428, -428907, 237079, 851457, 327108, -26467, 636241, -289927, -943566, 76533, -285917]
3170d29167B78624M2983N05380J31284e16014n00779K84716J25639B28221N50178
3180G78399M43228D86091a275388N10703d9569p45787C74370O68557G1837J15727
3190A87564L49015d6349r41229p5642G0608Q8479b86798A237211J30275b26918
3201c11272m54116r2613B57391R1487a39348c8815p5598C64772J11244k21606
3211B54410K95278C5572b51543Q77n83147J56601A44157f69712A24875J622539
3221A747414n52598E60256E95a009223n39754m1577a06240G36548k10073R93789
3231A520264o02391f81563a0763A26682a322766k09178d27692C83592O02732J55515
3241A141839q8794C6198a182298c83223n0633m03402F43277l9934b96211C50323
$$ y = [-429167, 278624, 321607, 826987, 958271, -516014, -1016793, -732077, -606438, 228221, 778399, 1221627, 486091, -1275388, -764685, -49569, -795356, 374370, 1042927, 71837, 187564, 536579, -46349, -987578, -1063220, 70608, 159087, -286798, 1237211, 1367486, -226918, -311272, -765388, -858001, 257391, 348878, -139348, -38815, -114413, 364772, 476016, 254410, 549688, 35572, -251543, -250666, -833813, -677212, 144157, -669712, 124875, 1747414, 1194816, 560256, 595, -1009223, -1548977, -1590554, -106240, 736548, 526475, 1520264, 917873, -681563, -10763, 126682, -1322766, -1531944, -427692, 383592, 986324, 1141839, 1053045, 36198, -1182298, -383223, -433856, -837258, 643277, 603343, -296211, 350323]
3252E20701j4595j18413e84794n67092K84541c06898D21787J97216M14476l5505
3262I97974e55438b45896G58351f29667p18397d16364l09661L13746A065941Q71030
3272A936971q89514a48626A27667h94588j469628a005017C98762e40455C39153
3282A751255N2443n75635A72651a390583q47327K85512e31737D68088M56984J044418
3292A969490m03916A10011Q9926f56879p90595M87495j11652K99245H76489J115674
3302A992163m23558C71914b07631n277j272375O59500F54653e66674k09758F45304
3313F54484K93675R64493F99010a316184n32820O57917R5653K86363A300188P47492
3323B047680E30196L34488K66937g48078o98273r3795q33904R07555I82765J869857
$$ y = [520701, 506106, 387693, -584794, -1151886, -867345, -306898, 421787, 619003, 1033479, 997974, -555438, -245896, 758351, -629667, -1348064, -416364, -726025, -412279, 1065941, 1936971, 1047457, -148626, 127667, -894588, -2364216, -1005017, 398762, -540455, 339153, 1751255, 1803698, 1228063, 172651, -1390583, -2237910, -1952398, -531737, 468088, 925072, 1969490, 1565574, 110011, 199937, -656879, -1447474, -959979, -1071631, -772386, 876489, 1992163, 1568605, 371914, -207631, -212908, -1485283, -825783, 654653, -566674, -776432, 645304, 654484, 948159, 1912652, 699010, -1316184, -1849004, -1191087, -1095434, -809071, 1300188, 2047680, 530196, 864684, 1131621, -748078, -1446351, -1540146, -2374050, -1466495, 982765, 2852622]
3333B852622o13312I68642m78343a129920j474777J049823g18599J52767A057887
3343A565983m05641N49058m24652d24890j078689p5165K62823M41668C70121J001362
3353A371483E20539K49179R92288D55780a09148A35917a493148j240370a170522
3363F07626L93592J65044O79467l13677c22263j26858k40308j518662N16202b59944
3374d12485H96664J923307o26497D2863a206465k85485j02438O00578D58438J7865
3384D76303b27256A222397l78103b78938D21565A17109a311460J03225c01211
3394E56777J55558Q4380k16614c06048l73398C22835H3423a32424D96386d79445
3405g51524E77396L22408D30123j04881h3824l25307j03599A90487o0848f74338
$$ y = [2852622, 2239310, 968642, 490299, -1129920, -2604697, -1554874, -718599, -565832, 1057887, 1565983, 1160342, 1709400, 1284748, -424890, -1503579, -1578744, -1315921, -874253, 370121, 1371483, 520539, 769718, 1762006, 455780, -109148, 135917, -1493148, -2733518, -1170522, 607626, 1001218, 1166262, 1845729, 1532052, -322263, -449121, -689429, -2208091, -1691889, -259944, -412485, 896664, 2819971, 2193474, 42863, -1206465, -1491950, -1594388, -993810, 458438, 476303, -227256, 1222397, 844294, -278938, 421565, 117109, -1311460, -1208235, -301211, 556777, 712335, 796715, 580101, -306048, -679446, 322835, 83423, -132424, 496386, -479445, -751524, 577396, 899804, 430123, 325242, -83824, -409131, -512730, 190487, 129639, -674338]
3416C47799Q15103b49789c9763H45195d12279r12071N71380a74637B66545K08626
3426D75171L21211A25806f96994b34643i4556q49663d04220H4208d4561G55398
3437I07891B71946a70108q44335l77947e74950C73609R14841n39563k95700k4556
3447D28631g76716j86602A86536f7775k42421B74867p8615J60464Q53092l26617
3457H83191g8934p97891M09130C9305e16751b0013D10027d59498a50271E26068
3468E15833L14381K9068d58339j078322J2643d39315A00483R2647R04701L22226
3478A420057D16773j60727c46747j013468J12233K07983M85683G43276K56093
3487I99369m43209j52658b50821R429o5718O1310B3477f18257b54812D48781e51148
$$ y = [347799, 1162902, -249789, -39763, 845195, -412279, -1324350, -752970, -174637, 266545, 475171, 796382, 125806, -696994, -234643, -94556, -944219, -404220, 84208, -44561, 755398, 907891, 271946, -170108, -1014443, -1392390, -574950, 373609, 1288450, 748887, 453187, 428631, -776716, -963318, 186536, -67775, -310196, 274867, 196252, 356716, 1209808, 883191, -78934, -876825, -467695, 39305, -516751, -20013, 410027, -459498, -150271, 526068, 515833, 830214, 859282, -458339, -1536661, -1524018, -439315, 100483, 193130, 1097831, 1420057, 416773, 256046, -346747, -1360215, -1247982, -1039999, -554316, 743276, 999369, 556160, 403502, -250821, -241392, -307110, -245800, 23477, -618257, -254812, 448781, -551148]
3499b35380A208908C31595c81591D61500N55447m78549e63614n02225N2752j47737
3509a160824C78557J364327H55926j75699R6460d86459k37770K81883J60972r4389
3519c75763l44082J95954C47641P97455J77488o21397c00846M9749o63717m02815
3529a317629a09076k55118n83846A16602N84460L08105K82368l04138c58222j314955
3539a673177R8643g42552m39547c01177A804446l70254n75393Q76440D45265a080965
3550a663554l53485K56169b30828A975875N16673I74959J9470l7526a062666n68345
3560a631011K88125n23114R18270F78479J100159P25304n41824F43555a017927
3570b190109N00396N15838L05973F22036j31037o4576J688805k82627F00828A57081
$$ y = [-235380, 1208908, 331595, -381591, 461500, 1016947, 538398, -563614, -1065839, -1013087, -1160824, 378557, 1742884, 855926, 680227, 776687, -486459, -724229, -442346, -281374, -375763, -719845, -523891, 347641, 1145096, 1322584, 701187, -300846, -251097, -914814, -1317629, -109076, -364194, -948040, 116602, 701062, 1009167, 1291535, 987397, -358222, -1673177, -1574534, -742552, -1182099, -301177, 1804446, 1434192, 858799, 1735239, 445265, -1080965, -1663554, -2017039, -1760870, -230828, 1975875, 2492548, 974959, 994429, 956903, -1062666, -1631011, -1342886, -1866000, -947730, 678479, 1778638, 2503942, 1962118, 643555, -1017927, -2190109, -1689713, -1173875, -867902, 622036, 490999, 426423, 2115228, 1832601, 600828, 157081]
3581a402774k076430M17781e34616A170706q1925J148235O88091H75155d52860
3591d85608j863051j026416J480035e84402H81433K175559J043955j309860c45715
3601b064958j23091o96882J251411B85353M07609J387770Q65544j409266o17322
3610I19688b21208j640025n85838O82005c39866D84665N72115J081678q09203
3619A329255C15440N61245c02951j871981M89093J46430J19729F55153K079655
3628B734808M8812A089806a50989o62648j366661j25848a027231m7544c0687B643631
3639B611666q85569n96244e53217k346055r94299J722697A55895J583409J156691
3648B895995J44863I53219a5807j97077j943003l58184P44006N24570D00758J786454
$$ y = [-1402774, -3479204, -3061423, -534616, 1170706, 1088781, 2237016, 2925107, 875155, -452860, -485608, -2348659, -3375075, -1895040, -584402, 881433, 3056992, 4100947, 2791087, -345715, -2064958, -2188049, -2884931, -1633520, 285353, 692962, 2080732, 2946276, 1537010, 919688, -221208, -1861233, -2447071, -1765066, -339866, 484665, 1056780, 2138458, 1329255, 315440, 876685, -302951, -2174932, -1685839, -1539409, -1419680, 655153, 2734808, 2783620, 1089806, -150989, -813637, -2180298, -2306146, -1027231, -1074775, -30687, 2643631, 2611666, 1726097, 1129853, -553217, -2899272, -3893571, -2170874, 155895, 1739304, 2895995, 3040858, 953219, -15807, -212884, -2155887, -2514071, -1770065, -1245495, 400758, 2187212]
3658B187212Q72007k42270A066435f36232j811470m78835J184438M96127c03426
3668B163481M97224j011120K64358I04703a202223j746825q9565J011556h20710
3678A200338J735049n50563p00728Q9200e64580k483927L4394L34855J145547
3687a533711F88403J811179J258130n19520A460362e59564k428617m16443P53144
3696b651480K89797A76907K656823N40747M81712j096173a38691k570218j566092
3705d275001K21105J946758A83030K692374R93838r07012l24261F28500a832782
3715c026366m96036N06186a112286H52068J788770J543289m92026A680130i71080
3725b641534m24086q21982Q73068i1388A744742J930496J430741j684690G34848
$$ y = [2187212, 3059219, 2816949, 1066435, -636232, -2447702, -2926537, -1742099, -1245972, -303426, 2163481, 2660705, 1649585, 1913943, 904703, -1202223, -2949048, -3038613, -2027057, -820710, 1200338, 2935387, 2384824, 1684096, 1773296, -564580, -3048507, -3014113, -2679258, -1533711, 688403, 2499582, 3757712, 3238192, 1460362, -559564, -2988181, -3404624, -2651480, -2361683, 176907, 2833730, 3374477, 3856189, 2760016, -138691, -2708909, -4275001, -4053896, -2107138, 183030, 2875404, 3869242, 2962230, 2637969, 628500, -1832782, -3026366, -3522402, -3016216, -1112286, 852068, 2640838, 4184127, 3692101, 1680130, -971080, -2641534, -3065620, -3887602, -3014534, -91388, 1744742, 3675238, 5105979, 3421289, 734848]
3735a695178k212370q84413P70629a306424B127581J487690Q97498j46481A604663
3745a436288k361004j273008J340940a499147A147857K666340N17958j076628
3753C255527A384349g31681j380760j212729l24527J220435e90455A639480K860606
3762D500086m42663j918939F78830a651057j985142k54199J339319e60936A140265
3772B470247J142414k73579j207869C19c425513j611546J050751J706992F69783
3782C459498Q52287l49969A947540c28574k084785j740358J83905J219323g82368
3792B301866K146601j93218j054793G04342b484170j307226j19110R05443f57350
3802A440964J303448P24795J90376j141223a097868k736211L16735K87822J218122
$$ y = [-1695178, -3907548, -4791961, -4021332, -1306424, 2127581, 3615271, 4512769, 4366288, 1604663, -1436288, -3797292, -5070300, -3729360, -1499147, 1147857, 3814197, 4332155, 3255527, 1384349, -731681, -2112441, -3325170, -3649697, -2429262, -590455, 1639480, 4500086, 4057423, 2138484, 678830, -1651057, -3636199, -3890398, -2551079, -560936, 1140265, 2470247, 3612661, 3339082, 2131213, 319, -3425513, -5037059, -3986308, -2279316, 669783, 3459498, 4311785, 3961816, 1947540, -328574, -2413359, -4153717, -3969812, -2750489, -782368, 2301866, 4448467, 4255249, 3200456, 704342, -2484170, -3791396, -3910506, -3005063, -657350, 1440964, 2744412, 3469207, 3659583, 2518360, -1097868, -3834079, -3517344, -3229522, -2011400]
3811b011400A119311J600802Q7648J9355q32662f0030j804582l54023l15491o04089
3821c138215a453912B007383J344442K40524r31819B92260a906256r20942k45685
3830c072883J115306f00184H82323J433432P35340K91601j563843a087651j722557
3839b810208j339110K47988g90694A995712J055245Q04804p42952A55277a795978
3849b428772K780o65333R61045I58875J872166L89743N31757A448276a602151
3859b408795m51786k31576J407302G91500J333082m6509M80319L29175H03698
3869a287427r74893j558324L40485f35594A282661J375319R78622o59964A228491
3879h57846j407435j119776m96459J519704D16648K207504J892767k96436A446569
$$ y = [-2011400, 1119311, 2720113, 2807761, 2827116, 1994454, -60030, -1864612, -2218635, -2534126, -3138215, -1453912, 2007383, 3351825, 3592349, 2660530, 292260, -1906256, -2827198, -3072883, -1957577, -600184, 882323, 2315755, 3051095, 3342696, 1778853, -1087651, -2810208, -4149318, -3901330, -790694, 1995712, 3050957, 3855761, 3112809, 155277, -1795978, -2428772, -2425992, -3091325, -2130280, 958875, 2831041, 3220784, 3752541, 1448276, -1602151, -2408795, -2860581, -3092157, -1684855, 791500, 2124582, 2078073, 2558392, 2887567, 803698, -1287427, -2262320, -3820644, -3480159, -635594, 1282661, 2657980, 3636602, 2976638, 1228491, -857846, -2265281, -3385057, -3881516, -2361812, 416648, 2624152, 4516919, 4220483, 1446569]
3889d45757k170416j875928O80423a222488F28261J224113J099182P80661j571473
3898B160744B12643i55639k534307j339555b085852G8475J028968J802966Q85554
3907C795963r01745E92883a042034o55199j513462k00416a583577b29349A482048
3917C889199r9668j498620D34475a985933j415673j48830P67143h14220A159650
3927C078136O21832p05335j266407h72934k833369J46339R60652M85390F0359
3937B835013N86462l48130j131092C04673a912378j371162N40867M37862i05412
3947B123178J074334r23690m20374E45330a050381q82153k62310L12318Q18966
3956a063560B31111J665471j95764J1495o5912a06504j532928L06095k16386K97160
$$ y = [-445757, -2616173, -4492101, -3811678, -1222488, 628261, 1852374, 2951556, 3732217, 2160744, 212643, -955639, -3489946, -4829501, -2085852, 78475, 1107443, 2910409, 3795963, 2894218, 592883, -1042034, -1697233, -3210695, -3411111, -1583577, -229349, 1482048, 3889199, 3789531, 2290911, 434475, -1985933, -3401606, -3550436, -2783293, -814220, 1159650, 3078136, 3699968, 2994633, 1728226, -872934, -3706303, -3559964, -2599312, -2113922, 60359, 2835013, 3421475, 3073345, 1942253, 304673, -1912378, -3283540, -2742673, -2304811, -905412, 2123178, 3197512, 2273822, 1853448, 545330, -1050381, -1932534, -2194844, -1882526, -1063560, 231111, 1896582, 1700818, 1712313, 1646401, -106504, -1639432, -1333337, -1549723, -1252563]
3966a252563d8039G26778Q05387N8927m91088n48686e39808r51083m43099L53964
3976a580026h9272A125092N8535M31104k27696A24223c06453p55629j263344O80793
3986a644633a14019A286607M36127q4803j37480E6073a962742R4079O79936e77303
3997F52626J30430j27044L52405k45531j57931b58602j063593j48507N29988g2617
4008H98054J15594j82107l89739e75671i2503B02915f25313k57798J76504p3057
4018g79664f9156H16478R12044j54937C7422i80357n34131J45927e9593D02924
4029A57201O89643O89539o31836l28063f70701q93735j25606P44307A98487P93941
4039I92428P10773K80202B41230a181376N77807j63282k82435e05199a07834B86783
$$ y = [-1252563, -48039, 726778, 1532165, 1591092, 1100004, 551318, -539808, -1490891, -1933990, -1580026, -89272, 1125092, 1183627, 1614731, 1387035, 124223, -306453, -1062082, -2325426, -1644633, -114019, 1286607, 1722734, 1637931, 1500451, 56073, -1962742, -1868663, -1188727, -577303, 652626, 783056, 656012, 1008417, 762886, 604955, -258602, -1322195, -1470702, -940714, -72617, 898054, 1013648, 831541, 441802, -575671, -92503, 202915, -625313, -883111, -706607, -779664, -69156, 816478, 1728522, 1573585, 37422, -980357, -1514488, -1368561, -59593, 402924, 157201, 846844, 1536383, 904547, 576484, -670701, -1564436, -1690042, -945735, 198487, 992428, 1703201, 1983403, 241230, -1181376, -603569, -766851, -1049286, -505199, -107834, 286783]
4050H88554K94878Q2566A15052i75430j22005j14848e69120B63124a70406A29933
4061E75344r7043N71894j16957i6620q05279n86697J9072N13755B81975J728855
4071B010830p01801d07551A71990L16537d25297O6267k10693q73431N80399E25166
4082A252713P4463k98379l43624h58710q22600b63014e854k6776E41939a95125
4093b43728E80887m5783j70953a7823m48300L5405j53919C32336M54079d36619
4104e50770A33934a86656D63548M45028a241j82880h3221o45737j01733c42655
4115E29521j13540a46595G63304j61797d55486A02200e31615j306475b7713A253701
4126E03194G5736J89397Q822g17780K61513H42515D2684h32244B67418b2557m77718
$$ y = [888554, 1183432, 1265998, 115052, -975430, -1097435, -1212283, -569120, 263124, -170406, 129933, 575344, 478301, 1050195, 933238, -96620, -901899, -1488596, -1469524, -955769, 281975, 2010830, 1309029, -407551, 171990, 488527, -425297, -359030, -569723, -1443154, -862755, 525166, 1252713, 1327176, 1028797, 685173, -858710, -1681310, -263014, -5854, -32630, 541939, -195125, -243728, 580887, 535104, 364151, -17823, -466123, -430718, -584637, 332336, 786415, -436619, -550770, 133934, -186656, 463548, 908576, -1241, -184121, -83221, -728958, -830691, -342655, 529521, 415981, -146595, 763304, 601507, -455486, 102200, -531615, -1838090, -27713, 1253701, 503194, 75736, 265133, 273955, -717780, -456267, 842515, 42684, -832244, 267418, -22557, -500275]
4137e00275F23212L88616C55088E3474a29445J8068l47972j52487i0210m59213
4147e49423d6731A044796J18341M65471o85425a570791j24179O69924l29715d62887
4158A137449Q67320p87094B86759A35101g94103r48337f81317K68524q89305C97183
4169A586593G70037l40327P0152l1795c31962o81731L65962l92643L59100F53807
4180H46110l19578R60042n38325a02363r013n33462o93946J10170f04552G51070
4191A318054M07487m8738B44961f81085n72683p57515h99706H55729j47482K2340
4201G30587J63660D34523j00955C4558h98942o31076J29772a2997C49495j32611
4211B16884J299855l3084e75947m04111L11594l32289K13347a43085B64317p0897
$$ y = [-500275, 623212, 1011828, 355088, 53474, -129445, -111377, -459349, -611836, -90210, -549423, -46731, 1044796, 1163137, 1628608, 943183, -1570791, -1694970, -1025046, -1354761, -462887, 1137449, 2004769, 1217675, 286759, 135101, -794103, -1742440, -681317, -412793, -1302098, 397183, 1586593, 770037, 429710, 499862, 468067, -331962, -1013693, -647731, -1040374, -681274, 653807, 846110, 526532, 1486574, 948249, -102363, -111376, -644838, -1338784, -1228614, -604552, 751070, 1318054, 1725541, 1676803, 244961, -681085, -1253768, -2011283, -899706, 855729, 708247, 730587, 894247, 434523, 333568, 34558, -898942, -1530018, -1400246, -12997, 349495, 216884, 1516739, 1483655, -575947, -980058, -668464, -1000753, -787406, -143085, 264317, 193420]
4221A93420L40744R55644G10523g56209c61670l32122n41243d36799E5908K63724
4231C19632L26814K8363N43756j27864i3294r24197j92569L52876c06567c0392
4242A158404N82196F08786j70305Q8409f73910j4920K6222o93319K59624C63810
4253B236084j36421B16379e54665o07561q95295i65303D22509R672L11281B80166
4264c61350J76574B3330K65691c76309o91595L38388h2628C60245R75535F27276
4275c77815p2252l36375b20139E93378A42849c31583g4570A39007O34179J65894
4285I39080r2954C17355g69789m70668n658N01283A155173P45238H22931j55844
4295F67087J70045a15962j014645n58437L05499N21249C84075J666953k30143
$$ y = [193420, 534164, 1489808, 710523, -756209, -361670, -693792, -1235035, -436799, 55908, 319632, 646446, 674809, 1218565, 1090701, -93294, -1017491, -1210060, -857184, -306567, -30392, 1158404, 1740600, 608786, 438481, 526890, -673910, -688830, -662608, -1355927, -1096303, 363810, 2236084, 2099663, 216379, -554665, -1162226, -2057521, -965303, 422509, 432181, 743462, 280166, -361350, -184776, 23330, 289021, -376309, -1067904, -729516, -82628, 360245, 1335780, 627276, -377815, -450067, -786442, -220139, 593378, 142849, -331583, -74570, 139007, 773186, 939080, 846126, 317355, -769789, -1240457, -1246115, -744832, 1155173, 1900411, 822931, 667087, 837132, -115962, -1130607, -1689044, -1383545, -862296, 384075, 2051028, 1820885]
4304A820885D96785j38351f45987j267110P20325e56951K5111a38012B25869O98837
4314I24706L66640l66691B25298h66255q02432M78873K18168C04532Q29899B08310
4325a11960I33627j34071k68051k63308i26427q31677K66995F1113R52829o4886
4335I49056R68163k84972e02701m64535d08089j06654O9202b12682k41644C16443
4346A585964K21550H08159c23639k95997r81555l05843a04629E47492n7513P07114
4356A197093p1884a37495j64960j6394m93322n35680e76425A18319a64628B81226
4367A218723B53080c46893F8188a51277k68635p0750l82752Q7776C12264N16817
4377H29081B91683p4748P27808j22885c81860a33968j54456j234410f24482E91479
$$ y = [1820885, 496785, 358434, -645987, -1913097, -1192772, -556951, -531840, -138012, 225869, 924706, 1291346, 924655, 225298, -866255, -1668687, -1189814, -971646, 304532, 1134431, 208310, -111960, 933627, 799556, 531505, 268197, -926427, -1758104, -1491109, 61113, 1013942, 949056, 1917219, 1632247, -502701, -967236, -408089, -514743, -445541, -212682, -454326, 316443, 1585964, 1807514, 808159, -323639, -619636, -1601191, -1907034, -104629, 547492, 489979, 1197093, 1125209, -137495, -302455, -318849, -812171, -1347851, -576425, 118319, -164628, 281226, 1218723, 253080, -346893, 68188, -151277, -419912, -490662, -873414, -785638, 312264, 829081, 291683, 216935, 944743, 821858, -381860, -133968, -288424, -1522834, -624482, 591479]
4388H5570Q63416J205847q83287g34851l50478d23957J23785o9570H14996l48620
4398D66376g57725e853D35221e806E79000J18393a39674k89189J40724r4770m28364
4409h11273J84799C46884D6563J40591J072182o21433B407a17287j161597p22547
4419b001431d42802F79260k38300J76446M71862l16565c94333m12620J23670l91002
4429a074285A15717P81845b22748i8189I28120G5601b24601F29774j90983b09390
4440f24768b01887j30746k40186A158092J65607a26158B25710J95689f48895J75185
4450d73710B73544b06290p68397c25523A168248J79305E19761B33423g81410r46086
4460a727496O97067L46327H9004J260736k80024A61764F3703e16181k26209b01648
$$ y = [85570, 948986, 2154833, 1271546, -734851, -1085329, -423957, -300172, -369742, 814996, 466376, -757725, -5853, 435221, -5806, 579000, 697393, -139674, -428863, -288139, -382909, -811273, -626474, 346884, 46563, 187154, 1259336, 637903, 2407, -117287, -1278884, -2001431, -442802, 679260, 440960, 617406, 1089268, 772703, -394333, -806953, -683283, -1074285, 115717, 897562, -222748, -98189, 928120, 75601, -224601, 629774, 438791, -209390, -624768, -201887, -332633, -572819, 1158092, 1323699, -126158, 225710, 421399, -648895, -473710, 273544, -206290, -974687, -325523, 1168248, 1347553, 519761, 233423, -781410, -1727496, -1030429, -684102, 89004, 1349740, 1069716, 161764, 63703, -516181, -742390, -201648]
4471c84861o39435J85200I69045Q13669C57125A13063M50776i15511p24303c92826
4482I578a09937D78555O82579m00768C3407L44066j84020a402269O30711d4008
4493b36869D24800N95499m46957B22770j7443G0361K564h18447l84289J21696
4503a081040f5405A573626k29485o66804p7102d58430q63105K19480j23432e55286
4514D86877K03535J72712L82681J54650C77202a915366p56208O87733Q72688H39152
4525B762692q05025q12185m80143i17016q32918K30672N76262n2788L75534A358477
4536B453219o91500l20213o09426a317359r07310J71664Q97068c2700D69683M55864
4546I25547P11489J59455k16846G03862a269493j112749m00710J030225F7225
$$ y = [-384861, -1024296, -839096, 969045, 1782714, 357125, 113063, 563839, -915511, -1639814, -392826, 9578, -109937, 478555, 1161134, 760366, 33407, 377473, 193453, -1402269, -771558, -44008, -236869, 424800, 1020299, 573342, 222770, 205327, 70361, 72925, -818447, -1202736, -1081040, -65405, 1573626, 1344141, 677337, 600235, -458430, -1321535, -1102055, -1225487, -555286, 486877, 690412, 863124, 1245805, 1400455, 377202, -1915366, -2671574, -1983841, -1111153, 839152, 2762692, 1957667, 1145482, 665339, -917016, -1749934, -1519262, -943000, -995788, -620254, 1358477, 2453219, 1761719, 1441506, 832080, -1317359, -2224669, -2053005, -1155937, -32700, 469683, 925547, 1637036, 1796491, 1579645, 703862, -1269493, -2382242, -2782952, -1752727, 67225]
4556E75208J465358J546795j546789d9220j043260r62514q59739K2892i47825
4566A355674R71901Q98142n15957F1309a724463j60931o02587L72768g14089B76589
4577A737682N43572J13861o49155b02952j689355q67248O4987a041056B29713
4587A170155J610137l64273I32670C99305c03945j415091p71471k91149J100194
4596a681462D09902K024694J388843j158116I29048c07391k153092j195247J270637
4605b385093Q92492A74145K163986N64496l54290n80694F82409a736322k160716
4614c897038N77095J629479e57943A762404J973157q98083j303900G36128a293846
4624b779698m04709R30991d94596H80298J909383K71913j353145o46899d02693
$$ y = [575208, 2040566, 3587361, 2040572, -49220, -1092480, -2054994, -2914733, -2891841, -947825, 1355674, 2327575, 3225717, 2709760, 61309, -1724463, -1885394, -2487981, -2115213, -714089, 276589, 1737682, 2281254, 2395115, 1745960, -202952, -1892307, -2759555, -2694568, -1041056, 229713, 1170155, 2780292, 2416019, 932670, 399305, -303945, -1719036, -2490507, -2781656, -1681462, 409902, 2434596, 3823439, 2665323, 929048, -307391, -2460483, -3655730, -2385093, -1492601, 174145, 2338131, 2902627, 2548337, 1967643, 682409, -1736322, -3897038, -3319943, -1690464, -557943, 1762404, 3735561, 2837478, 1533578, 736128, -1293846, -2779698, -3184407, -2253416, -494596, 880298, 2789681, 3061594, 1708449, 1061550, -402693]
4634b475704q311K30448P49998H29756R78079K97380N58824m59318A60351b452830
4645c212314J364292J81903e23299B084324J77916l5481M44780A016297a570161
4655b694507m16572J06881J415899A500047K267634m28837o27837A250358a985670
4665c228262L24790k31966a244008A339710J141688P58807K31603j365899g73504
4675c275719M1437M86270N13319D10833K171923K66497L82852q81793a39150j622275
4685a761425o31836l68486p6581a395353A370340J338887M63724j0818A155591
4695f39862p49161k368222m86096a686585B82439J755411K020228K1660j952756
4704B126982f31615j570243q31660j334611K005464F46882R45464J140841J442070
$$ y = [-2475704, -2484015, -2253567, -1503569, 829756, 1807835, 2105215, 2664039, 2204721, 160351, -2452830, -3212314, -1848022, -1666119, -523299, 2084324, 2262240, 2226759, 2671539, 1016297, -1570161, -2694507, -3111079, -3004198, -1588299, 1500047, 3767681, 3338844, 2711007, 1250358, -1985670, -3228262, -2903472, -3135438, -1244008, 1339710, 2481398, 3240205, 3471808, 2105909, -773504, -3275719, -3234282, -2748012, -2234693, 410833, 2582756, 2849253, 3232105, 2350312, -139150, -1761425, -2393261, -2761747, -2838328, -1395353, 1370340, 2709227, 3172951, 3162133, 1155591, -639862, -1389023, -3757245, -4243341, -1686585, 282439, 2037850, 4058078, 4079738, 2126982, -631615, -2201858, -3033518, -4368129, -2362665, 646882, 1592346, 2733187, 4175257]
4713D175257j770880c7692j616459j373431p42812P12018A0383K607307K53552
4722B871242L62507j175362b9921n75795j338304j539140R38439h87130B31793
4732B042663J194115j12681j508492b08151j703860j805531L46140i56748C7185
4742I24261K329162J51631j211291H35150a490123k009308l86067J350442d31936
4752A088048J933154J024402j882247H02052b01348l055731p60157J567714a089835
4762C74335K194584J266989n01545A115582g79794j660459j365335J371544g00601
4772b93432A336368J936620L7285r36477a05735k147229o60550k80400J233204
4781a960710h0440A704203J389891q13663q26732l20719i02506j396063K55032
$$ y = [4175257, 2404377, -37692, -1654151, -3027582, -3770394, -3058376, 10383, 2617690, 2871242, 3233749, 2058387, -29921, -605716, -1944020, -3483160, -2544721, -887130, 231793, 2042663, 3236778, 3124097, 1615605, -208151, -1912011, -3717542, -3371402, -956748, 37185, 924261, 3253423, 3405054, 2193763, 835150, -1490123, -3499431, -3885498, -2535056, -431936, 1088048, 3021202, 4045604, 2163357, 802052, -201348, -3257079, -4017236, -2449522, -1089835, 374335, 2568919, 3835908, 3334363, 1115582, -779794, -2440253, -3805588, -2434044, -700601, -293432, 1336368, 3272988, 3310273, 2373796, -105735, -2252964, -2913514, -3193914, -1960710, -80440, 1704203, 3094094, 2280431, 1453699, 1132980, -902506, -2298569, -2043537]
4790b043537p29164L40030D88936K344690O38104o91795j068890a82951k797061
4799b980012m77426J462052j39579g63598B120165J294070j8957q70772C61763
4809a658190j983855n44233J577678c92886B282686J429001p88717j030942C25172
4819a361299p05992r33165j22182h05942A271279P94373N52058l68100r80780
4828A268830d59818j451043j29955l00220O07618A60355M79941R22707J642476
4837C205479p65570D87579g00708j681394r46511Q24514e15340A421511K40636
4846A662147O09291M16959I12790d45850j276898j666811L98842i24661I40629
4856B336850L59660k89337A134184a265204j156302L58047O14086c61313A58153
$$ y = [-2043537, -2772701, -2432671, 488936, 2833626, 3471730, 2779935, 1711045, -182951, -2980012, -3457438, -1995386, -2134965, -763598, 2120165, 3414235, 3395278, 2524506, 361763, -1658190, -3642045, -4186278, -2608600, -392886, 2282686, 3711687, 2922970, 1892028, 325172, -1361299, -2067291, -3000456, -3122638, -805942, 1271279, 2065652, 2617710, 2249610, 1268830, -459818, -1910861, -2040816, -2341036, -1733418, 160355, 640296, 1563003, 3205479, 2439909, 487579, -700708, -2382102, -3328613, -2504099, -515340, 1421511, 1662147, 2271438, 2688397, 912790, -445850, -1722748, -3389559, -2990717, -924661, 940629, 2336850, 2696510, 2407173, 1134184, -1265204, -2421506, -2063459, -1449373, -361313, 158153]
4866E61666J727255M3180A094050E30912a128277j604651O03013J044371a88065
4876F03544J349501O17402I53786c1121C27948a172468j504248J271486M48849
4885i56381c65516A342074J090483K2039I27971d57982q30778o52752J33894Q66919
4895i40699L37431H26084J420096n13958l72256E10943a297815k58386J57073
4904a399128j96129g68263G99913J392686m79422E31351K12728b40816j618453
4913a859269J79688O71320Q6538A203036P34550p07991E33610C0510b85349p75368
4923a060717P8391b01806m69539b28849A430905n05107C07354Q47271a08074j167235
4933a275309K97762Q1416k7548a74058I82037L75972A13837L64973Q49208c59153
$$ y = [561666, 2288921, 2332101, 1094050, 530912, -1128277, -2732928, -2129915, -1085544, -188065, 603544, 1953045, 2570447, 953786, -31121, 327948, -1172468, -2676716, -1405230, -956381, -365516, 1342074, 2432557, 2454596, 927971, -457982, -1288760, -1941512, -1807618, -940699, -603268, 826084, 2246180, 1732222, 1359966, 510943, -1297815, -1556201, -1399128, -1595257, -768263, 799913, 2192599, 1713177, 531351, 744079, -240816, -1859269, -1679581, -1008261, -921723, 1203036, 1937586, 1229595, 533610, 30510, -285349, -1060717, -982326, -201806, -671345, -228849, 1430905, 925798, 307354, 1154625, -108074, -1275309, -977547, -896131, -923679, -174058, 982037, 1358009, 113837, 478810, 1328018, -359153]
4944a465930K5767m05127f99955A019491J93244L54032j61188o94143f87511j243482
4954a930993L56306L39748N90185A253706L54336G17251Q34242p58761a281685
4964a386547d79795j98270K59480C13964P01531C41181K03955Q67637C78280a191597
4975d71842k14367o6603C53684J12098h8734D61653M17953j00351A49944c93069
4986d45678j070730L49976F5266j8274J365783J126264B66157a065941K55668
4995h10273J99011j76570K93324f3325A44590k032R35303L0883a17209L1472m02202
5006d87939j263038g08476B04650O5239N49252p6198e4583r6560B11404K78353
5016D89757b00652k46362E8970f06065N738A196701k42492d30760D44562M81500
$$ y = [-1465930, -1440163, -1845290, -699955, 1019491, 1212735, 1566767, 1405579, 711436, -687511, -1930993, -1574687, -1234939, -644754, 1253706, 1608042, 717251, 1551493, 792732, -1281685, -1386547, -479795, -678065, -418585, 313964, 1015495, 341181, 545136, 1412773, 378280, -1191597, -471842, -686209, -752812, 353684, 465782, -88734, 461653, 879606, 779255, 149944, -393069, -445678, -1516408, -1166432, 65266, 46992, 1412775, 2539039, 266157, -1065941, -810273, -611262, -787832, -494508, -63325, 144590, 142558, 1077861, 1108744, -117209, -85737, -487939, -1750977, -708476, 204650, 269889, 819141, 742943, -54583, -151143, 211404, 489757, -200652, -447014, 58970, -606065, -600327, 1196701, 954209, -430760, 444562, 926062]
5026I26062B29391c06318p9386O6002n02066K54237F62449A69601L32180Q97915
5036A399696B7085g19742a53072k40158J50559j76469p62368b32132I45522K13950
5046A159472m80545b42339j23352k78054m70777B29605K00071e69998K03293b0872
5057b48847D65365O08790j07591H6373a097958L64533j61879K89842A053488k61391
5067G92097c64371G24238M10982E64382K2546g68485r58376L60772d01932G61229
5078A081515M75576K55472a14833j367396P30608p0202L47173B16471c01206A08320
5089F04942M0766L34695a98517m48275J38523l43865J66086J66157P3189F86589
5100G17760A97002Q61000E12758a101419J20376K01513k75964K47939B78312J416678
$$ y = [926062, 229391, -306318, -385704, -319702, -821768, -567531, 662449, 169601, 501781, 1399696, 27085, -719742, -153072, -393230, -242671, -419140, -1181508, -232132, 945522, 1159472, 678927, -242339, -365691, -643745, -1114522, 229605, 429676, -569998, -366705, -20872, -248847, 465365, 1074155, 966564, 86373, -1097958, -733425, -895304, -605462, 1053488, 792097, -364371, 724238, 1135220, 564382, 586928, -768485, -1726861, -1366089, -401932, 761229, 1081515, 1557091, 1812563, -114833, -1482229, -751621, -821823, -474650, 216471, -301206, 108320, 604942, 645708, 980403, -198517, -646792, -508269, -852134, -686048, -519891, -446702, 686589, 717760, 197002, 1058002, 512758, -1101419, -981043, -779530, -1055494, -807555, 278312, 1694990]
5110A694990n37678C42236O08658A23573a282576K35652k41745K58847E60249
5120A849892K76053A027990c79442a10327k91427p11509N15014A8476M13944J93707
5130F26127c00794F73365N90730D5411g1919l15550q24479M44698I4410M88715
5140E83125k69815c15312C71880F4257g20169C02708j23251i59402c30608O4378
5150b66230k77612I9392K98146K1282j91656e31881j74748l5777b05807A027323
5161D68369b30548F28483B575g92202J69249J83410B94568M33316k62846J66227
5171F31265k81404J47924K12161g12991m16539L16882l4074D49771J098621m62420
5181A085972K95484n69572a050408l81834M51198M32635J91903a47999A076804
$$ y = [1694990, 1157312, 342236, 950894, 123573, -1282576, -1046924, -1288669, -1029822, 560249, 1849892, 2125945, 1027990, -379442, -110327, -401754, -1113263, -598249, 18476, 432420, 626127, -300794, 673365, 1264095, 45411, -71919, -387469, -1211948, -767250, 94410, 583125, 313310, -315312, 371880, 64257, -720169, 302708, 179457, -959402, -330608, -266230, -543842, 99392, 397538, 418820, 227164, -531881, -706629, -742406, -205807, 1027323, 468369, -230548, 628483, 2575, -792202, -622953, -439543, 294568, 727884, 465038, 631265, 349861, 497785, 709946, -712991, -1129530, -812648, -846722, 449771, 1548392, 1085972, 1381456, 811884, -1050408, -1432242, -981044, -548409, -356506, -147999, 1076804]
5191F33834b17961A446522l70645a017729k25381n1779k81228f47671D30728N34909
5201I65637j21705l26719P19432C30661a425603N73707k88317k15555e79045K48864
5211c30181A288670J317447q66868D24652b84467j145777l81302j01496i23115
5221E96274N59891J408444K11327B52320d72213R3211j612293L73456d14624D24065
5232G70933O4998Q25044k57056G4042B2508g21602j547131O08699g91120a19640
5243A660390k3896B79140A17108J77179N7421e23951j139538K11321k75388P60221
5253i67335A615243K92400m33187K15335e2908j918445k33560Q34147I6234J05068
5263B01302e1611G68019J21988K75752J26211b84949o83664O2007r11313d07754
$$ y = [633834, -217961, 1446522, 1075877, -1017729, -1243110, -1294889, -1576117, -647671, 430728, 965637, 843932, 517213, 1236645, 330661, -1425603, -851896, -1140213, -1355768, -579045, -330181, 1288670, 2606117, 1739249, 424652, -284467, -1430244, -1811546, -1913042, -923115, 596274, 1156165, 2564609, 2775936, 252320, -472213, -379002, -1991295, -1617839, -414624, 424065, 770933, 835931, 1660975, 1403919, 74042, 22508, -721602, -2268733, -1660034, -791120, -119640, 1660390, 1636494, 279140, 117108, 294287, 351708, -523951, -1663489, -1452168, -1727556, -967335, 1615243, 1907643, 1474456, 1689791, -52908, -1971353, -2204913, -1370766, 96234, 201302, -51611, 768019, 890007, 1165759, 1291970, -284949, -968613, -906606, -1817919, -407754]
5274A050031j96986rK1674C59830a14342q8446C47465g5396j076004c51794d0841
5286f08640H84693O80558B81626e4857J10A00299b79727r71307N10450a05925
5297E0546Q03933C43618b83667C89184b0989n79483e7571k76801j19266d8538
5308c68343J18598C42169L04929J53795e40306k60362B59906a28609B83556N12641
5318G96197d59927k78881K53327A71544J080960k86573B98255j12176f45272p1938
5328g17210L36634P484H55104r6132c94920D22895M14994B55291J63873c38825
5339a434198K4818c03017A391962m83704G6252P52310A69168a206291N29361c05600
5350H2368K12756c42346O3555i6478j94007G01864k8942a55815j30415j23202
$$ y = [1050031, 853045, 853036, 874710, 359830, -114342, -202788, 347465, -75396, -1151400, -351794, -40841, -608640, 884693, 1565251, 281626, -54857, -54747, 100299, -279727, -1251034, -740584, -105925, 50546, 854479, 343618, -283667, 389184, -20989, -600472, -57571, -334372, -453638, -48538, -368343, -249745, 342169, 647098, 800893, -540306, -800668, 259906, -128609, 283556, 796197, -459927, -738808, -485481, 171544, 1252504, 965931, 298255, 186079, -645272, -717210, -380576, -373092, 855104, 758972, -394920, 422895, 837889, 255291, 419164, -338825, -1434198, -1409380, -303017, 1391962, 908258, 76252, 828562, 169168, -1206291, -676930, -305600, 82368, 295124, -342346, -278791, -96478, -290485, 701864, 672922, -155815, -286230, -409432]
5360d09432k73430K75063l12216H6132R30739B40211N17339j2225c76263k86994
5370f63257j6004K85865J20316k25161H56195P08240E27041k08976d2735q29769
5380h72504L80162N6916k9992I11199N3868D33267a49575q51683L73964C32687
5391D59642J90000d2428l60501G7636e85711q0687A01884l1179L60078k9040b45541
5403B04992J06031b93468i8500j73027j37188J10532N7177D84479P1581b15501
5414D17039M73384b74017L651M5085m40487K07352R5166A57724n9173J35085J770969
5425B004605m59395g44318l89536j18856j66842O70036F3022J137743P00980H77874
5436F14973B34713f62881m3022k98707m84086L79468c81604A381552J308397j344586
$$ y = [-409432, -682862, -407799, -720015, 86132, 1016871, 240211, 757550, 745325, -376263, -663257, -679261, -393396, -273080, -498241, 856195, 1564435, 527041, 318065, -42735, -872504, -492342, -435426, -465418, 911199, 965067, 433267, -149575, -1001258, -627294, 332687, 459642, 649642, -42428, -402929, 77636, -585711, -666398, 101884, 70705, 430783, 401743, -245541, 204992, 311023, -293468, -98500, -271527, -408715, -298183, -241006, 484479, 556060, -215501, 417039, 890423, -274017, -270366, -225281, -665768, -458416, -363250, 157724, 98551, 233636, 2004605, 1545210, -744318, -1133854, -1252710, -1419552, -749516, 63022, 1200765, 1901745, 877874, 614973, 234713, -662881, -705903, -1004610, -1488696, -1109228, -381604, 1381552, 2689949, 1345363]
5446A345363C89538a20030j757087l79142a056978c36661B32140J8825J235353
5455A486318L64018C38999j2942j15172a667848o38496O82374P57220H09379J147562
5465A956941n9561n64716B22565E8583c79968j589381j0427P82956M21652A292018
5476A967386n5021L56126A027885a109596j161018l71723Q18846g04688C64607
5486B174692M90860m61129n36015g75286j831216q836J77080h37960A145751M49572
5496A595323J5049J16169m95488D20840a071219o94221m9981m93740e99766A322951
5507A195950R80779L22004E56506a311681m37563O03213J57491p29582g03148
5517I25191N72800J222389k49949A57745a519849j105654j87783a389414e5893
$$ y = [1345363, 389538, -120030, -1877117, -2256259, -1056978, -336661, 232140, 250965, 1486318, 1850336, 338999, 326057, 210885, -1667848, -2306344, -1623970, -866750, 809379, 1956941, 1897380, 1332664, 222565, 58583, -379968, -1969349, -1979776, -1196820, -775168, 1292018, 1967386, 1912365, 2268491, 1027885, -1109596, -2270614, -2642337, -1823491, -704688, 364607, 2174692, 2665552, 2204423, 1668408, -775286, -2606502, -2615338, -2438258, -837960, 1145751, 1595323, 1610372, 1726541, 1231053, 420840, -1071219, -1765440, -1815421, -2309161, -599766, 1322951, 1195950, 2176729, 2498733, 556506, -1311681, -1749244, -1146031, -988540, -1718122, -703148, 925191, 1497991, 2720380, 2470431, 157745, -1519849, -2625503, -2813286, -1389414, -55893]
5527A889422J099039j091217F41408c24779n83766m08080r08220M00525A57208
5537F25918Q21553J668719j384482b74215j045855m44911K2977K17591e85551
5547A248354N2043K11309M41467B77588g10355K9811j167706j39993R15986B3553
5558A939825J68693o24374m11431a2203r42839r32619j171955a368923D02183
5568I92940J469698J42928A074591g7909j124295r31720m86K46067a44764A210747
5579A554875J000600k05868F66552d95976k224874n49116J193635i56422A330774
5589C076785p51829o70971F37977g13341r29430j448086N86658d37272C01321
5599A459102J555966o51402r30194c5849j932388q65906J539a236266G29422L04260
$$ y = [1889422, 2988461, 1897244, 641408, -324779, -908545, -1316625, -2224845, -1824320, 157208, 625918, 1447471, 3116190, 1731708, -274215, -1320070, -1764981, -1742004, -1524413, -585551, 1248354, 1300397, 1511706, 1953173, 277588, -710355, -680544, -1848250, -1988243, -1072257, 23553, 1939825, 2108518, 1484144, 1072713, -12203, -955042, -1887661, -3059616, -1368923, 402183, 992940, 2462638, 2605566, 1074591, -77909, -1202204, -2133924, -2134410, -1888343, -144764, 1210747, 1554875, 2555475, 2349607, 666552, -495976, -2720850, -3269966, -2076331, -956422, 1330774, 3076785, 2324956, 1653985, 637977, -713341, -1642771, -3090857, -2504199, -437272, 301321, 1459102, 3015068, 2363666, 1433472, -35849, -1968237, -2834143, -2832604, -1236266, 729422, 1033682]
5609A033682Q67292J139033j185927E77382h88346j734811J50906J45069N88044
5618a739138H19753J497643P81248K50089A660267d51730k235571j516302J316728
5627b886875J351498A46380K655180P74643m83480p75219b34970j959779p75925
5636b970674m64193J515704d85229A145250K442658K38568j476132E46540b068562
5646b490052J71935n11484a231755I73726R22387J174038m15717j091448D27330
5656a722101r82489k44029m300d50540B009861O72436O44174j033605F89893g13828
5667b978087n75692J255065J028132G75913K365190L12973q36031F18547h41587
5677a475181k001834K13547e74424D88893J368002J165636n02002r61884a93159
$$ y = [1033682, 1900974, 3040007, 1854080, 577382, -888346, -2623157, -2472251, -2327182, -1739138, 819753, 2317396, 3098644, 3348733, 1660267, -451730, -2687301, -4203603, -2886875, -1535377, 146380, 2801560, 3576203, 3092723, 2317504, -234970, -2194749, -2970674, -3434867, -1919163, -485229, 1145250, 3587908, 3826476, 2350344, 546540, -2068562, -2490052, -2318117, -2829601, -1231755, 973726, 1896113, 3070151, 2654434, 1562986, 427330, -1722101, -2704590, -2948619, -2952919, -450540, 2009861, 2682297, 3326471, 2292866, 689893, -713828, -2978087, -3553779, -2298714, -1270582, 775913, 3141103, 3454076, 2618045, 618547, -841587, -1475181, -3477015, -3263468, -574424, 488893, 1856895, 3022531, 2520529, 1558645, -193159]
5687a886264p53784o73978a593739A125192Q7234N69496O00055p44732o97694
5696I39551g15645j805442K44391L44592O87518H56280J257941P17536m57128
5705B374629C49065e09787j549025o46365a196700M83423K65821A514091M08948
5714A923039N5759J3143A24880a383444j431282M6372g64135B75391R87524J476445
5724B739360q92032q19820m79253a762178q24793R36132K33977e13186H77135
5734B524541P52796A129925b38174p62405j942562P92749e62156J34037H13227
5744B091292K58799m05485A67275h66528l96337j425562P31493e10259C69921
5754A910358L45172p18765L7795e6229j617458L19197p53372k15655g41571A373575
$$ y = [-1886264, -2640048, -3314026, -1593739, 1125192, 1212426, 1781922, 2381977, 1637245, 939551, -715645, -2521087, -2276696, -1932104, -1244586, 856280, 2114221, 2831757, 2374629, 349065, -509787, -2058812, -2705177, -1196700, -713277, -447456, 1514091, 1923039, 1978798, 1991941, 124880, -1383444, -2814726, -2768354, -764135, 275391, 1262915, 2739360, 1847328, 1027508, 548255, -1762178, -2586971, -1650839, -1416862, -513186, 877135, 2524541, 3277337, 1129925, -238174, -1000579, -2943141, -2150392, -562156, -428119, 813227, 2091292, 2350091, 1944606, 167275, -866528, -1262865, -2688427, -1956934, -510259, 369921, 1910358, 2255530, 1536765, 1574560, -56229, -1673687, -1354490, -2107862, -2323517, -741571, 1373575]
5765C274634o81738r41818p77333a739878j065291J171737n01987P48261A269787
5775B530825j01072p02315q44927A04075b252699j171643J232756h65783I10238
5785B813363p92603m19791m86444e77259m84264o12633o12416J088028b21570
5795H45881J098200k75693K96518H05622a246285r6184m93893m90097c55786G44754
5806I29871R97149J9006m13417C59526a541563o49717k47329J209720H94957o3310
5816H31647L26004J575540j215378b55932o19558j118086j55721R23686b40712
5826A062963J61299P19139L38044d46353j130509O47318n99400K18231d09556
5836A00216J132934K52778l94885N8222c02281j099340L51336j23002e02251A8746
$$ y = [3274634, 2592896, 1651078, 873745, -1739878, -2805169, -1633432, -2135419, -1387158, 1269787, 2530825, 2429753, 1727438, 882511, 104075, -2252699, -3424342, -2191586, -865783, 910238, 2813363, 2020760, 1600969, 1114525, -577259, -1061523, -1674156, -2286572, -1198544, -221570, 845881, 1944081, 1668388, 1964906, 805622, -1246285, -1342469, -1836362, -2326459, -355786, 744754, 929871, 1927020, 1946026, 1532609, 359526, -1541563, -2191280, -2438609, -1228889, 894957, 831647, 1157651, 2733191, 1517813, -255932, -875490, -1993576, -2149297, -1225611, -240712, 1062963, 1224262, 1943401, 2281445, -446353, -1576862, -929544, -1528944, -1310713, -409556, 100216, 1233150, 1485928, 1091043, 1149265, -302281, -1401621, -1050285, -1173287, -502251, 18746]
5847B13288J526923l59584B84723K52782a27214j263878N46232J48064J46744
5856e50052D9629Q56795J203989I30676g75496B81893b74626j100958M48344J63599
5866g63641H2579J104115j07785p6620C21110e29152K12418p75805j98166b36853
5877I9157Q56308L29536D4535K84363n5261a275363K62998M55316K04438E64890
5888F26376K06753j84524f39393b72489A50788g90803L79143j4182m2836I27725
5899E68017D4065M48876A59997E7334a87152o65879d02404K1389E4999Q99336
5909I54335A07715J51912J504843D87011a123312J134J71909d42625B34160L23605
5919E57765N59061m98219e223A89823h76368j87996c59669j94462B32414L61085
$$ y = [213288, 1740211, 1380627, 284723, 537505, -127214, -1391092, -844860, -696796, -550052, 49629, 906424, 2110413, 930676, -775496, 281893, -274626, -1375584, -927240, -763641, 82579, 1186694, 1078909, 1002289, 321110, -529152, -316734, -1092539, -1290705, -236853, 99157, 955465, 1285001, 44535, 328898, 273637, -1275363, -1012365, -557049, -352611, 564890, 626376, 833129, 648605, -639393, -272489, 150788, -790803, -411660, -425842, -468678, 927725, 568017, 44065, 492941, 159997, 57334, -187152, -853031, -402404, -381015, 54999, 954335, 107715, 259627, 1764470, 487011, -1123312, -1122178, -950269, -442625, 234160, 557765, 1116826, 618607, -5223, 189823, -876368, -1064364, -359669, -554131, 232414, 593499]
5929E93499f5732G95439C91667g38236J89392j01628c21459A43696E4562M06207
5939D60769a61445p56091G96304P6460d83207i5558k7902r2616e9760k96613e7684
5951B91060J9436K61210e3615j92754G39561a35137n59978E0334d18032B73343
5962A251879D4819e16923d7427f899A31457a74253A49272L43403f35007b37661
5973H61917b96227P4391A67794c29754A62070R362a09057D77692a25984n64422
5983f90406Q7029Q2739F23680j53659a77556B59351b10165m99766H30735a23243
5994a433760d37475D25673n3808c0985D54555P15193a99625j073038G6480c90611
6005d54112A185474D52269a51089A95571O1117L38985A73885e19593a68102r4741
$$ y = [593499, -65732, 795439, 391667, -738236, -548844, -650472, -321459, 143696, 54562, 460769, -161445, -917536, 796304, 872764, -483207, -95558, -123460, -216076, -59760, -356373, -57684, 291060, 310496, 571706, -53615, -246369, 739561, -135137, -695115, 50334, -418032, 273343, 1251879, 44819, -516923, -47427, -6899, 131457, -174253, 149272, 492675, -635007, -237661, 861917, -296227, -221836, 167794, -329754, 162070, 171432, -109057, 477692, -125984, -690406, -603377, -520638, 623680, 470021, -177556, 259351, -210165, -709931, 830735, -123243, -1433760, -437475, 425673, 371865, -30985, 454555, 1169748, -199625, -1272663, 76480, -390611, -454112, 1185474, 452269, -151089, 195571, 256688, 595673, 173885, -519593, -168102, -262843]
6015b62843i4945E66940a09546A88227K66626d92765D50873K16021g77482c80927
6026a2299l52192j52269f1670A051822j72981c45571a05261n66206p03121C37780
6037C94263i06631C80645P72273D55838A01417f79178j54435K06540K70220G31273
6048D27203j76072J008947b29062j162911f0984k3657j31308D20244j60401J0999
6058B70842G5909L36208O96646a57054m65972A0477c44124a49308F27780c91672
6069A60783N39756A53739N72888C34589f48178j9134j24383r8571Q9082E675K211531
6080B217206p57357f87957D6805a03085j570475O70800M88300Q4763D48794M52223
6090I01017N11272C72122g69214I5050e40673j299760d68396A55596n013Q26878
$$ y = [-262843, -94945, 566940, -109546, 188227, 454853, -492765, 450873, 666894, -777482, -380927, -12299, -364491, -516760, -61670, 1051822, 878841, -345571, -105261, -671467, -1374588, 337780, 394263, -906631, 380645, 1152918, 455838, 101417, -679178, -833613, -627073, -356853, 731273, 427203, 251131, 1260078, -229062, -1391973, -60984, -84641, -215949, 420244, 259843, 270842, 75909, 412117, 1108763, -157054, -623026, 10477, -344124, -149308, 627780, -391672, 160783, 700539, 153739, 726627, 334589, -648178, -667312, -791695, -890266, -801184, 5675, 2217206, 1459849, -687957, 46805, -103085, -1673560, -1002760, -514460, -429697, 448794, 901017, 1412289, 372122, -769214, 95050, -540673, -1840433, -468396, 155596, 150583, 977461]
6100I77461k68485j22214K60378c43533j05644j27436n27777c82902f6599I80909
6111A609690F9661L17293O97358e15529k62032K28127p76732c60262G48817M2621
6121G91438Q497l90006L17772C23786a412135L90347d40015l99841B28524J28867
6131C57391G7969J148099L4634A30204g46867n64254L67181O2443P2383A041371
6142I91366D18682J006140A76127a080765M56939l13781L17856f2485B60141N61708
6152H21849j42403k74514K94961c09453m21595a29054m48847D4248K18866g45076
6163F75272P95189e2838l0817A79259b267j03626p74101c59212b946m97677A181079
6175A358756b04972A44627n8893a197970O522M62013D12787Q31048D15656N9906
$$ y = [977461, 708976, 586762, 847140, -343533, -449177, -576613, -1104390, -382902, -66599, 980909, 1609690, 69661, 386954, 1084312, -515529, -777561, -549434, -1326166, -360262, 748817, 791438, 799935, 409929, 727701, 323786, -1412135, -1021788, -440015, -839856, 228524, 357391, 77969, 1226068, 1260702, 130204, -746867, -1311121, -943940, -881497, -809114, 1041371, 991366, 418682, 1424822, 176127, -1080765, -623826, -937607, -619751, -62485, 260141, 821849, 679446, 404932, 699893, -309453, -731048, -129054, -577901, 44248, 263114, -745076, 675272, 1470461, -52838, -83655, 179259, -2267, -105893, -879994, -359212, -2946, -500623, 1181079, 1358756, -204972, 144627, 85734, -1197970, -1191448, -729435, 412787, 1243835, 415656, 475562]
6185D75562A80997f72056L15195k67763j63772B54112b74196B80552J030615C4104
6196d42455i1311n91879J39524a22433A04497N54342F6715R7216M51500g34168
6207a53203I88513a58511l78849J62337L7654G90214k65048d8441A11608m6415
6217F5193L39462F2132i92645D3748J71000g09895H70504o0834b09485D75777
6228e1695q93306L49256K37625F72380B91037d24768C26915j60340e58547F66281
6239a36760p35942b99544k79741D99181N76187C6485b25087h8327k80488N6394
6249c12421m13751A28740R34212e19747a27614E18633d46158C93983M77132f10348
6260i33817a61466G14315k6608d02793B87013J16797f21837B06850L10191c01962
$$ y = [475562, 180997, -672056, -356861, -624624, -788396, 254112, -274196, 280552, 1311167, 34104, -442455, -91311, -683190, -543666, -122433, 104497, 658839, 66715, 163931, 615431, -734168, -153203, 988513, -158511, -537360, -375023, -337369, 790214, 525166, -48441, 111608, 65193, 404655, 62132, -992645, 43748, 214748, -709895, 870504, 809670, -209485, 475777, -51695, -945001, -595745, -358120, 672380, 291037, -424768, 326915, 166575, -558547, 666281, -136760, -872702, -299544, -579285, 499181, 1075368, 36485, -225087, -88327, -368815, -312421, -726172, 128740, 1062952, -519747, -127614, 518633, -446158, 393983, 871115, -610348, -933817, -161466, 714315, 687707, -402793, 287013, 403810, -621837, 206850, 517041, -301962]
6271D62527B6449a007670I3110a4014A69309M02077I9908f2471l78743o4793E95245
6283b89436n81152D68454e4175o890H98836E6015f62668J28601b9270C83693c5498
6295f8050G97599b08642m07061a06495o44524D29692O17466d34709d0385F52607
6306b18061M8993m30268j80852L48869A58032J477933o90397h69104A88082H0285
6317a483288c65619G75212A49978E0402Q6208L53156F9056d16620E54777E7634
6328a150951d26909a60800P7216A183699C06189a42389G20759A12125a87078l3957
6338b21035p73029J01704d01335C20239O40832B33881R69735N53833i50368q08733
6348a759101f36267l90205d62663E60687J90939L61999k14742j58323F9158a781670
$$ y = [462527, 26449, -1007670, 93110, -14014, 169309, 571386, 99908, -62471, -441214, -506007, 595245, -289436, -870588, 468454, -54175, -61065, 898836, 56015, -662668, -534067, -29270, 383693, -35498, -68050, 797599, -208642, -615703, -106495, -751019, 429692, 1047158, -434709, -40385, 652607, -218061, -169068, -599336, -780188, -431319, 158032, 1635965, 945568, -869104, 188082, 80285, -1483288, -365619, 775212, 149978, 50402, 136610, 489766, 69056, -416620, 554777, 57634, -1150951, -426909, -160800, -83584, 1183699, 306189, -142389, 720759, 112125, -187078, -221035, -994064, -892360, -401335, 320239, 961071, 233881, 1203616, 1757449, -950368, -1759101, -636267, -1026472, -462663, 560687, 751626, 1113625, 898883, 740560, 69158, -1781670]
6359a213460e40042o35773B17379J058680o19981P22679k36237b32123k33833
6368d65956o88470J17238K04271K40565G48256L27972l26063J213207F68377a215500
6379g13528l65839j25801N95657R4329E74315J380390m84608m55597c7164p73358
6389h10522k2605j082764M35293G9895r144J541251R15641F98185B6432L7794
6399F4226a041292r18103j03104d41902G92403k42456J326661M48260A79657a57790
6410e07255j410277j37343R21822C01474J298927q8748l5201k80158b88566k71974
6420e60540n04879m90931O81657J45153C69776J596684I39251k36713P54177g909
6431a570162l39928N89144b7185m0930F28100J018050q10160O8968L05483i51677
$$ y = [-1213460, -540042, -1175815, 217379, 1276059, 656078, 1378757, 1142520, -232123, -465956, -1154426, -1037188, -832917, -592352, 748256, 1076228, 750165, 1963372, 668377, -1215500, -713528, -1079367, -1205168, -609511, -515182, 574315, 1954705, 1470097, 1014500, -37164, -810522, -833127, -1915891, -1480598, 79895, 70751, 1612002, 2527643, 698185, 26432, 64226, -1041292, -1959395, -2062499, -441902, 792403, 549947, 1876608, 2324868, 179657, -157790, -507255, -1917532, -2054875, -1133053, 301474, 1600401, 1511653, 1476452, 1196294, -288566, -560540, -1065419, -1556350, -874693, -729540, 369776, 1966460, 939251, 702538, 1456715, -7909, -1570162, -1910090, -1320946, -27185, -68115, 628100, 1646150, 835990, 904958, 1210441, -951677]
6442b130959O99388J5994c12273I05775Q40022M36063A034911A79595g84021j504619
6452b288640O77589f79314r3602I29389O39482n85211N75462E49910a214929n45458
6462a760387k30748f75197D24433n9408J074777j58255m45813O733c87990j066094
6472a454084M60617k18004L81238C47836M46603J023621J88260D72852f30780
6482a514705K34576f01221r75859f75672A634335j96925L10813N28575A77408
6492a501581r32139J55435J056835b81630A424105J370473r61602o38375D23450
6502a385813k14888k26104k65760e28583D59845J403273J598867j072253A93867
6512a087471q32830R3929k39825M11508A031427O39043m6999R86585j192265a33015
$$ y = [-2130959, -1431571, -1415577, -312273, 905775, 1745797, 2181860, 1034911, 179595, -784021, -2288640, -1611051, -679314, -772916, 929389, 1568871, 983660, 1559122, 549910, -1214929, -1760387, -1991135, -675197, 424433, 365025, 1439802, 1281547, 835734, 842467, -387990, -1454084, -993467, -1211471, -830233, 347836, 794439, 1818060, 2006320, 472852, -630780, -1514705, -1280129, -601221, -1577080, -675672, 1634335, 1437410, 1748223, 2276798, 177408, -1501581, -2433720, -2278285, -1221450, -281630, 1424105, 2794578, 1832976, 1194601, 423450, -1385813, -1600701, -1826805, -2092565, -528583, 459845, 1863118, 3461985, 2389732, 193867, -1087471, -1920301, -1826372, -2066197, -1654689, 1031427, 1670470, 1623471, 2610056, 1417791, -133015]
6523h94330j476317n93879P56789b07076B083006J92833k20714J58396D06545
6533h45899n71494j817168O23813h41482a80813A925990J369896p62139j037118
6542A496629d25090r24648r89267j165990a453990C88728K90673J684133P30901
6551C094435j263239p38018i58886k154804K2980P72541a44344A454162M03551
6560A857713O51265l98246F55401D8874b183855p57057a280975L6980N09396A783812
6571B743179m77213r51790a28543j076952j458590O04035e65941m98308A30738
6581B541672m82106l69581k59776e41735j353637p25905K23462a013075C01135
6591A853212J348368j085242I72145e82180k171669Q64629N74025m29006A26631
$$ y = [-894330, -2370647, -2964526, -2207737, -207076, 2083006, 2275839, 2055125, 2213521, 406545, -845899, -1417393, -3234561, -2610748, -841482, -180813, 1925990, 3295886, 2533747, 1496629, -425090, -1349738, -2339005, -3504995, -1453990, 388728, 679401, 2363534, 3094435, 1831196, 1093178, -958886, -3113690, -3090710, -2318169, -144344, 1454162, 1857713, 2508978, 2110732, 655401, 48874, -2183855, -2940912, -1280975, -1243995, -734599, 1783812, 2743179, 2265966, 1314176, -128543, -1205495, -2664085, -2060050, -565941, -1064249, 130738, 2541672, 2059566, 1689985, 1430209, -541735, -1895372, -2621277, -2397815, -1013075, 301135, 1853212, 3201580, 2116338, 972145, -582180, -2753849, -1889220, -1315195, -1744201, 126631]
6601B040413J65697j90547H90262c68928j026011q64127R53494O4293N36796A989366
6612B195872A048022J64088H6074a043869j3933p86104M07360c24862D31498J370935
6622A802433l35344Q0307k47699a122216p14866P55224j281455P71378A232669
6632A973965K7022l53612n98568a0396k095498J14634N34243m27789C71703K244258
6642B615961q42977l62013k76106a86691n46079j427791l38658h27339a323A089402
6653A806804j03760L97411C30183a680249J33054q37128J92234F06622M56758
6662A063380k86641J072092j20435p07224e81439j090085J80286r04373O58513
6671a737098A306914L70294J8042O05083H34095e08092p90212p46613P36411M76349
$$ y = [2040413, 2206110, 2015563, 890262, -368928, -1394939, -2259066, -1305572, -1241279, -704483, 1989366, 2195872, 1048022, 1212110, 86074, -1043869, -1057802, -1843906, -1436546, -324862, 431498, 1802433, 1467089, 1547396, 1299697, -1122216, -1837082, -1081858, -2363313, -1591935, 1232669, 1973965, 2000987, 1647375, 1048807, -10396, -2105894, -1991260, -1457017, -1884806, 371703, 2615961, 1772984, 1410971, 1134865, -186691, -732770, -2160561, -2499219, -827339, -1323, 1089402, 1806804, 1703044, 2100455, 330183, -1680249, -1547195, -2384323, -2192089, 606622, 1063380, 776739, 1848831, 1728396, 1021172, -581439, -1671524, -1491238, -2395611, -1737098, 1306914, 1677208, 1695250, 2300333, 834095, -508092, -1298304, -2044917, -1308506, -832157]
6681h32157c12029H58570J16782J162502O58521D45535i39703r16573j164020
6690c020296J483483c245D15005J625739N70245q80076H61458a054407m18361
6699a472768j02574q24921a183804B04299J039558J826274r45005C29453a25987
6709a726651o85333R89800N05686C0944O64217N64378J090145H84234e0297B32665
6720a844297m94859h74996R4117f709A426054L61693K04641F87395a32403E5010
6731a847838j002474J341904c61568A633824R93234j062218L2622A32303a601585
6741a165490l98101r2392G674O50996O66940R0857l70654N67880b56441k369510
6751b625951J237031M37439k6105A024188K77479m58990k09898b4233F43280A11700
$$ y = [-832157, -312029, 858570, 975352, 2137854, 2796375, 445535, -939703, -1856276, -3020296, -1536813, -3245, 415005, 2040744, 2610989, 1730913, 861458, -1054407, -1472768, -1575342, -2400263, -1183804, 204299, 1243857, 3070131, 2125126, 329453, -125987, -1726651, -2411984, -1422184, -916498, 30944, 695161, 1259539, 2349684, 884234, -50297, 232665, -1844297, -2339156, -874996, -780879, -6709, 1426054, 1787747, 1992388, 687395, -132403, 55010, -1847838, -2850312, -1508408, -361568, 1633824, 2627058, 1564840, 1597462, 132303, -1601585, -1165490, -1563591, -1655983, 7674, 658670, 1325610, 1416467, 1045813, 1613693, -256441, -2625951, -1388920, -951481, -977586, 1024188, 1301667, 842677, 632779, -24233, 643280, 111700]
6762a235889M30292n35949L32644E76608K0876Q26761L26949B7397e93995m35781
6772a029776o88708c71111A70790c4587D79507P200P64144J44912f41558l06247
6782i47805L02889p11157a74266G5667K25286J244649n01825A88677m8542g63000
6793c71340j31069k04656C64897n4098j33720J353223D02378h46791A32070e03342
6804h26226a29285f1445C19410A01598J61781J084053b37209j000318C6603d99295
6815c93342B75347b01609F22880j40547g33206h0144k1245j71319C63395e41016
6826d92773g3855j26228A187022k90734g15587B15287Q3153a255577e49324B67717
6837E50727K30286C40153M82310B19956f52182B00679b58686q43858G3346J99916
$$ y = [-1235889, -805597, -1341546, -1008902, 576608, 597484, 1424245, 1751194, 27397, -593995, -1029776, -1718484, -371111, 170790, -34587, 479507, 486707, 1250851, 1395763, -641558, -947805, -644916, -1356073, -174266, 75667, 300953, 1545602, 1043777, 188677, 140135, -763000, -371340, -502409, -707065, 364897, 310799, 177079, 1530302, 402378, -846791, 132070, -503342, -826226, -129285, -61445, 319410, 101598, 263379, 1347432, -237209, -1237527, 36603, -499295, -393342, 275347, -201609, 622880, 482333, -733206, -80144, -101389, -272708, 363395, -541016, -492773, -73855, -200083, 1187022, 896288, -715587, 215287, 298440, -1255577, -549324, 267717, 550727, 781013, 340153, 822463, 219956, -652182, 200679, -258686, -1102544, 73346, 273262]
6847B73262K37944R48703B98515b11231r3422q14155e17881J37449J82163A033859
6858D17871A21252M21091a077257c82399I39576g7877n37133J83803j7035B81342
6869C5284K39667P08858d1708F993f4504j216973c41481B53592d75628D03327
6880B44164d0496I99477k82713a95232k18203m71951b01700N9476A09162J375857
6890A485019E52505e13733F18261A34737h81130i1129d737B18900a19349l01291
6900d20640D22728j57448c5944G41386g9489m77097F22193a96496m54100K66225
6910c84371l43634D22141M15437b53385A7835J42830A2751R3199h19833b70993
6921A48136i98471a47289F07841A58847Q22642j92948d12040k28998k52379a92212
$$ y = [273262, 511206, 1459909, 298515, -211231, -304653, -1118808, -517881, -380432, -198269, 1033859, 417871, 121252, 542343, -1077257, -382399, 939576, -77877, -615010, -431207, -448242, 281342, 35284, 274951, 983809, -41708, 6993, -64504, -1281477, -341481, 253592, -475628, 403327, 244164, -40496, 999477, 716764, -195232, -413435, -885386, -201700, -142224, 109162, 1485019, 552505, -513733, 618261, 134737, -881130, -91129, -4737, 218900, -119349, -420640, 422728, 265280, -35944, 741386, -79489, -556586, 622193, -196496, -650596, -384371, -728005, 422141, 837578, -253385, 17835, 160665, 12751, 105950, -819833, -270993, 148136, -998471, -147289, 607841, 158847, 981489, 788541, -412040, -641038, -893417, -192212]
6932D26327a46510A4984K7651d17800A034389l997c9662B40133h41247m33239
6942a274486a15907e2771C52835M24964j13178M9899b16573j69961A091992a6734
6953a508339O87249j00449a36348A398310l30649Q5151C03998g42556c39414j113595
6963a453009o6393b3729A01890K01797K78367B20216R70758E48878a200369N29636
6973f70733j67895m34845b12670F59020K20853k87070A11973Q59467D78866a151467
6984d86943r079o58893A27559J68949M8688M46729j34612L86862C40264a120532
6995d06304M755q43568c61047D20234P92266R08488C11798d99894O247p51569
7005a245216c69400a02807l34476C88723J60848p4309M44391i3959c4362q7944
$$ y = [426327, -146510, 14984, 42635, -417800, 1034389, 1030392, -39662, 240133, -841247, -1274486, -115907, -52771, 352835, 777799, 664621, 714520, -216573, -386534, 1091992, -16734, -1508339, -821090, -921539, -136348, 1398310, 1067661, 1152812, 303998, -742556, -339414, -1453009, -1519402, -23729, 101890, 303687, 582054, 220216, 1190974, 548878, -1200369, -670733, -838628, -1273473, -212670, 659020, 879873, 592803, 111973, 971440, 478866, -1151467, -486943, -496022, -1154915, 127559, 296508, 345196, 791925, 657313, 1044175, 340264, -1120532, -406304, -401549, -1245117, -361047, 420234, 1212500, 2120988, 311798, -499894, -493647, -1245216, -369400, -102807, -437283, 388723, 549571, 475262, 919653, -93959, -34362, -122306]
7015a22306j278469O78684b1021E4495J048395l67950b97306b0094l86398J63608
7025b42884D66585a78792j45426j00950l59191I36442j41430b90016E59343A98672
7036f22490K36768l18980B54997L81099A84120L42988B45505f24075D79409A22824
7047f73809c31998K974G01915K03427d10866D57126J84639f65381P7505K61684
7057c26192m9431B68915J5453O45555j32621h80188a58198A76843a028181c57074
7068A46538d7596E13487B48799R8860R996d91819A37571a7387j165125N21100
7078f61412B03981M44719N49407a74582j8748F35651e07529j27663b06717k87719
7088d94436A00908J85946c3975F88700C33787J12252M27987h63157k51922a96869
$$ y = [-122306, -1400775, -722091, -21021, 54495, 1102890, 734940, -297306, -20094, -406492, -242884, 466585, -178792, -324218, -425168, -784359, 936442, 795012, -290016, 559343, 198672, -622490, -385722, -704702, 254997, 636096, 184120, 527108, 245505, -624075, 479409, 122824, -673809, -331998, -329024, 701915, 905342, -410866, 457126, 641765, -665381, -587876, -326192, -375623, 268915, 284368, 929923, 797302, -880188, -158198, 176843, -1028181, -357074, 146538, -47596, 513487, 248799, 347659, 357655, -491819, 137571, -17387, -1182512, -661412, 203981, 648700, 1198107, -174582, -193330, 635651, -507529, -635192, -206717, -494436, 100908, 286854, -33975, 688700, 333787, 446039, 874026, -863157, -1115079, -196869]
7099g19971h5170F52041j54030O49611D69307a21145j47424r67997N05355d1752
7110e51188F92725K28775a2287A071812j12487g68720j22261k85793e62917I7837
7121H1824J067006k15212b0645D88981b25384r74865A04367L7543c02513j05592
7131d08105l87541D53440Q67316C40893J21565H5492f61954K52454p89806d42780
7142F30281a81941C83555R86077i0704I4598K82533f12002k95932k39626b25692
7153I92864B87658O40353K50679h24219L46067I5067f05038b75743M0691H720
7164F63023i1087L079E04793F0943K76046a01998r93238A46174a01323n41641
7174f42964B88735E8177J02904R12621C64077b56657k18116o6815B36049c28488
$$ y = [-719971, -85170, 652041, 498011, 1147622, 469307, -121145, -268569, -1236566, -731211, -41752, -551188, 692725, 921500, -12287, 1071812, 959325, -768720, -890981, -1176774, -562917, 97837, 81824, 1148830, 933618, -20645, 488981, -225384, -1200249, 104367, 141910, -302513, -408105, -795646, 453440, 1320756, 340893, 462458, 85492, -661954, -409500, -1199306, -442780, 630281, -181941, 383555, 1369632, -90704, 94598, 377131, -612002, -907934, -1147560, -225692, 992864, 287658, 928011, 1178690, -824219, -478152, 95067, -605038, -275743, -235052, 8720, 663023, -91087, -88008, 504793, 60943, 336989, -101998, -1095236, 146174, -101323, -642964, 288735, 58177, 161081, 1073702, 364077, -256657, -474773, -541588, 236049, -328488]
7185g01303D95174A43222a50444H74318B836J46846o3741i23448b32636D5785
7196d70574E01723j97972e7003C0666f39804D92803N66850d60273K1143N7634
7206c81496p07544A75553O35856C62370G2857a89556D56330j40982h56569A44677
7217E12960h19198L31046J68333A14469J306943E89239a0883A14095a064924M49505
7227f15419a3301n69898A40254J06900K28777N99724B5742a39904B81961a093188
7238g43988C1697h3980C92313J82229k69743L41731d44006l8150D96165e43773
7249e64049e4808l31842F43584L8330b33366E29442k12324E0882L36409g68596
7260a116556c15755k9431H23015J59961B22183O88203i3373j345652N32819K68836
$$ y = [-701303, 495174, 143222, -150444, 874318, 2836, 149682, 85941, -923448, -232636, 45785, -470574, 501723, 303751, -57003, 30666, -639804, 492803, 1059653, -460273, -439130, -381496, -1089040, 175553, 811409, 362370, 72857, -189556, 456330, 315348, -856569, 144677, 512960, -819198, -488152, -319819, 114469, 1421412, 589239, -10883, 114095, -1064924, -615419, -13301, -583199, 140254, 247154, 475931, 1075655, 25742, -139904, 281961, -1093188, -743988, 31697, -83980, 392313, 574542, 304799, 646530, -444006, -482156, 496165, -543773, -564049, -54808, -386650, 643584, 681914, -233366, 529442, 317118, 50882, 387291, -768596, -1116556, -315755, -345186, 823015, 982976, 222183, 910386, -93373, -1439025, -906206, -637370]
7270f37370B93034O33106G7303N09443R6657d95375f6725j94513p33075d09912
7281d91256D51000Q13789b3045B96716Q9327a098173d83993b49k57479B33806
7292d216B41529R5376e59942G31249N01860h50261j04166M55333j79251C08845
7303I3343L65384Q54781C11902I3006d6473j168021L67508b30016M462G55122
7314D63615K05415Q22107c64387o49212d53347o66037L76749A37660L00591Q30900
7324A269151n19516q0869K47835a054112l66317d51378n42729c6756I09911B44288
7335A122476K19207B53238g9594j165271j37286O82058n26400B4837J274812j74386
7345A125263R16925I34732a124191L85694j44856j98565M85755j39775E40406
$$ y = [-637370, 293034, 926140, 77303, 586746, 683403, -495375, -66725, -261238, -994313, -409912, -491256, 451000, 1264789, -23045, 296716, 386043, -1098173, -483993, -249, -257728, 233806, -4216, 241529, 336905, -559942, 731249, 1233109, -850261, -954427, -499094, -678345, 308845, 93343, 458727, 1313508, 311902, 93006, -46473, -1214494, -846986, -230016, -225554, 755122, 463615, 669030, 1491137, -364387, -1013599, -453347, -1119384, -742635, 137660, 438251, 1269151, 749635, 668766, 916601, -1054112, -1420429, -451378, -994107, -36756, 909911, 244288, 1122476, 1341683, 253238, -79594, -1244865, -1382151, -700093, -1226493, 24837, 1299649, 1125263, 2042188, 934732, -1124191, -738497, -883353, -1081918, -596163, -735938, 540406]
7355A732988H53608M06187E51090f17818m0128j034407L42b08217O4499A107944
7366B283322q97425E18815I1920a097969m19723n29451R46860E09906j19962J404471
7376A794415J070375E15443d35106J42642j459320m74102N66011a67770A659649
7386A524417q4503P1419b15372l19864l62008j175092P36906e80450g7043A242411
7397A094626J74424O40269D41537a137602p70513l02999h71008M23772A90800
7407B368666o55706H30746N01828b80341j631393P687j03856h30482D15587R58202
7417A373789J303319r81925D97238a24232j979438k18217h78557Q1099C60078
7427A306707k51037P34022n47558b68325q43273q28220O86584c31944o20015D81629
$$ y = [1732988, 853608, 1259795, 551090, -617818, -657946, -1692353, -1692011, -208217, -143718, 1107944, 2283322, 1385897, 518815, 91920, -1097969, -1517692, -2047143, -1100283, 509906, 389944, 1794415, 2864790, 515443, -435106, -292464, -1751784, -2225886, -1659875, -167770, 1659649, 1524417, 1439914, 1511333, -215372, -535236, -897244, -2072336, -1335430, -580450, -77043, 1242411, 1094626, 1269050, 1909319, 441537, -1137602, -1908115, -2211114, -871008, -447236, 190800, 2368666, 1712960, 830746, 1332574, -280341, -1911734, -1904047, -2007903, -830482, 415587, 1373789, 2677108, 1695183, 497238, -124232, -2103670, -2321887, -878557, -797458, 360078, 1306707, 1055670, 1789692, 1242134, -268325, -1111598, -1939818, -1253234, -331944, -951959, 481629]
7438B070907r17886K5010n39181i30503j25198p25475J60254e43339A524J546122
7448A547646O84707I96001l08271e24529j029792O41634p45753L29472F56921
7458G89277N86155J121807A163250c73845j209110l66889P95300k36772b50149
7468B075323k31192p01926K13699B3684g87183l97089q70913M74609g88828H37322
7479B850820q55067I53094D15188a194233k30931k63094j95311c0567I18712k90760
7489F27952J118490M8079H02402A46143a717586l61076J29356M14652H21982O93575
7499A515557k72187N58492p12336b39934p3606j362331n60213P00769N33762I81002
7510B113714l62852L83794G69754h24053o84389j534314J018284B75253r1764
$$ y = [2070907, 1153021, 1178031, 638850, -930503, -1055701, -1781176, -1620922, -543339, 1524, 1547646, 2232353, 996001, 687730, -524529, -1554321, -912687, -1658440, -1328968, 656921, 789277, 1375432, 2497239, 1163250, -373845, -1582955, -1949844, -1154544, -1391316, -250149, 2075323, 1844131, 1142205, 1355904, 23684, -787183, -1184272, -2055185, -1580576, -788828, 837322, 2850820, 1995753, 953094, 415188, -1194233, -1425164, -1688258, -1883569, -30567, 918712, 627952, 1746442, 1794521, 802402, 146143, -1717586, -2078662, -1949306, -1534654, 821982, 1515557, 1243370, 1801862, 1089526, -239934, -313540, -1675871, -2236084, -1535315, -1001553, 981002, 2113714, 1750862, 2134656, 769754, -824053, -1508442, -3042756, -2024472, 275253, 183489]
7519A83489J029292J313429m61179p19432d04621j565938P0193k24299g57044
7529A051546k28698P68244N76761H76129A71101i08321r96031O71029n14318N35446
7539a212195A098256M97975L01576m618D57294c71435j194496o92303h21250j29684
7549i50934k256A189842Q03988L1335l50556D2961a369941j002481q5991g42528
7560c08751H47399K084602j143781F68371B64933a170261j61556J01866p97595
7569b027546e41060I67573P49964N06155r02448B96924c37677j562990K49167
7578a651500N50352J19281H47929O95393l96185L04419G06235d34149j55093j185414
7588a774656J13313O59693M48953A120968N93877l03110R8668f4193j147813L81033
$$ y = [183489, 1212781, 2526210, 2065031, 1345599, -404621, -1970559, -1900366, -2124665, -757044, 1051546, 822848, 1591092, 2167853, 876129, 171101, -908321, -1904352, -1233323, -1747641, -1212195, 1098256, 1596231, 1897807, 1893189, 457294, -371435, -1565931, -2258234, -821250, -950934, -953190, 1189842, 1993830, 2025165, 1674609, 42961, -1369941, -2372422, -2458413, -742528, -308751, 847399, 2932001, 1788220, 668371, 264933, -1170261, -1331817, -1229951, -2027546, -541060, 967573, 1717537, 2223692, 1321244, 296924, -337677, -1900667, -1651500, -1101148, -981867, 847929, 1543322, 1147137, 1451556, 706235, -434149, -589242, -1774656, -1661343, -1001650, -552697, 1120968, 1714845, 1411735, 1510403, -64193, -1212006, -830973]
7598h30973j436162K96412C70247O78480M65500k84054k58025m7677g61895q83296
7608a645191O25307r03330R39031A264999j64677J95324N08357H90495E4694a616822
7619b330386h80694J23708A48450J325783j19656L22781p24603f58518L02120
7628c56398q11070j002855d81198B88323K1856J035722K09690k01844C66707a143285
7639h79406q07608j76431E31627J17339A45604J447663k08271E16083a77037j095797
7649a272834N11041l62262l19032b17261B92305R13388J479832I51589c05441
7659f64678j410697N37476d09812P1223I47454M30157j63270J718d6030j78177
7669b24207q2822j730040Q39228d4175j55107A630074M73745G83841C26837f45683
$$ y = [-830973, -2267135, -1970723, 370247, 1048727, 1514227, 1230173, 972148, 924471, -761895, -1645191, -1019884, -1923214, -984183, 1264999, 1100322, 1295646, 1804003, 890495, 54694, -1616822, -2330386, -880694, -756986, 148450, 1474233, 1354577, 1677358, 952755, -658518, -356398, -1167468, -2170323, -481198, 288323, 310179, 1345901, 1555591, 1353747, 366707, -1143285, -879406, -1687014, -1863445, 531627, 648966, 145604, 1593267, 1384996, 516083, -177037, -1272834, -761793, -1124055, -1443087, -217261, 292305, 1205693, 2685525, 951589, -305441, -664678, -2075375, -1537899, -409812, -338589, 947454, 1377611, 1214341, 1216059, -46030, -224207, -307029, -2037069, -1197841, -44175, -199282, 1630074, 2103819, 783841, 326837, -645683]
7680a447856d92733r3216K84852N9640m477A509124p18035A35382J225415C4578
7691a625131P49130k15135L52481F35735L88381K85145C61160a22317H33756g06851
7702a974688f14305N4345A32001J005356m48770L16614m10164g22843K67837j90364
7712f45370l36428c000j50472G03551L36008I9852P25510C88784a469534e30843
7723c1912n27746E80190J52430H2128a42697j55505A087514m67053a108200c34060
7734d99473n20102E79661L51945l14422N70322b94066m13070o0206j41402E03306
7745B52245d78211D87541B4265L07138J078388a40158p74878L33894p04624e05520
7756F11225J58344M07277A48732b73244A73759h27120c16661A85064h48250i4183
$$ y = [-1447856, -492733, -585949, -301097, -241457, -245934, 1509124, 791089, 135382, 1360797, 34578, -1625131, -876001, -1091136, -738655, 635735, 1024116, 1309261, 361160, -122317, 833756, -706851, -1974688, -614305, -559960, 132001, 1137357, 688587, 1005201, 595037, -722843, -455006, -645370, -981798, -3000, -153472, 703551, 1039559, 99852, 825362, 388784, -1469534, -530843, -31912, -559658, 580190, 732620, 82128, -142697, -298202, 1087514, 620461, -1108200, -334060, -499473, -1019575, 579661, 931606, 617184, 1187506, -294066, -707136, -767342, -908744, 503306, 252245, -478211, 487541, 24265, 331403, 1409791, -140158, -915036, -581142, -1285766, -505520, 611225, 769569, 1176846, 148732, -273244, 173759, -827120, -316661, 185064, -848250, -94183]
7767B86804d1548A391546j56236d89025R4121n15868J78224B5111e8878G08681
7778G25459I9705R97841A69960a074253B83122a394p29963c30966J03692D11970
7789E14577a20874E68501B80320c34193B25661g58630k46224d065l77661D45225
7800A113210d5301B89651J68579g19256K99929N6332j54418a11822k49730F37701
7811A208131b36224E02193l863a019021M07390a35991A41044P20091f0628n43852
7821f04480A96c39164H70066j55038b68879E43033d33192p32429h2506k69825
7831c52331A4740J246614C58293a61282D9596a23301B18179e39271k21478C75929
7842d41115N3590A151842B81806N14O5631f60310c13832O4733k93212D50819G2331
$$ y = [286804, -41548, 1391546, 1235310, -489025, -394904, -910772, -732548, 25111, -58878, 708681, 725459, 99705, 1097546, 169960, -1074253, 283122, -1394, -731357, -330966, -227274, 411970, 514577, -120874, 568501, 280320, -334193, 225661, -758630, -1004854, -4065, -381726, 445225, 1113210, -45301, 289651, 458230, -719256, -419327, -362995, -517413, -111822, -361552, 637701, 1208131, -236224, 502193, 498330, -1019021, -611631, -135991, 141044, 861135, -60628, -604480, 196, -339164, 870066, 715028, -268879, 543033, -433192, -1165621, -82506, -352331, 14740, 1261354, 358293, -161282, 49596, -123301, 218179, -539271, -760749, 375929, -441115, -387525, 1151842, 281806, 282320, 347951, -660310, -313832, -249099, -542311, 450819, 72331]
7854b35274B76677b14458E23766K86372h4904B28768d26654j147250g2959D12070
7865b12229F77304J87538j13029a68392o68708B67335G516a012751B1133f1454
7876e94461A114292l44442A18223K95979e92188P9524J38020o23508A39460J45504
7886B84964N063N41576B03326J0658L97937h27106J77330C9979f81909a65027
7897E55764j31445J82247F9722D145L82950f26405P9857b28973p77178E84455
7908I46124a35113D02715L7275a08114B83680a69698l72033J60256k74820B42166
7919A30702J8367J795930F60293a278705O26245k7209Q4291E27342L472J66876
7929F97690A39655f54648D27245A68037e81273A57951f06053o9569B87412G3597
$$ y = [-235274, 276677, -214458, 523766, 810138, -84904, 228768, -426654, -1573904, -72959, 412070, -212229, 677304, 864842, 751813, -168392, -837100, 267335, 7516, -1012751, 21133, -61454, -594461, 1114292, 769850, 118223, 414202, -592188, -512664, -374644, -998152, 139460, 284964, 290027, 831603, 203326, 213984, 611921, -827106, -649776, 39979, -681909, -165027, 555764, 424319, 606566, 69722, 4145, 387095, -626405, -546548, -228973, -1006151, 584455, 946124, -135113, 402715, 439990, -108114, 283680, -169698, -541731, -381475, -656295, 242166, 130702, 149069, 1944999, 660293, -1278705, -652460, -679669, -595378, 527342, 530814, 697690, 139655, -654648, 427245, 168037, -581273, 157951, -606053, -675622, 287412, 73597]
7940E68640M02986e16652J56066J12010l12986C84167J81742B07083d02096p68589
7950a170685D04960O07010c84439B73897J71266h95542L95659G1606A6641N93182
7960F09823k63270N2030b25383r14507B20397J26447i05290A99313K07909C9296
7971H63330c2581m55439J83534m97383a32249B50046M7419M23008A60854e7196
7982E43990d76059l06636g364o58995b81526F44851B72741M84044l4025b45471
7993c31671l95282a77618D93895f88670L44236D87034f6733A218876J18826c62055
8004d45096k03893n70309M43233h5058A095830j7764b63853D71548j15390e29385
8015B88622a01129j281487N59967b87812E39021P45121l92047n0350B10706a132255
$$ y = [568640, 971626, -516652, -360586, -248576, -561562, 384167, 565909, 207083, -402096, -1170685, 404960, 1011970, -384439, 273897, 445163, -895542, -499883, 71606, 16641, 609823, 346553, 398583, -225383, -1139890, 220397, 346844, -905290, 199313, 407222, 39296, 863330, -32581, -488020, -304486, -801869, -132249, 250046, 297465, 720473, 160854, -57196, 543990, -476059, -782695, -7364, -666359, -281526, 644851, 272741, 756785, 722760, -245471, -331671, -726953, -177618, 493895, -688670, -344434, 487034, -66733, 1218876, 1337702, -362055, -445096, -648989, -1219298, -776065, -85058, 1095830, 1078066, -263853, 471548, 356158, -529385, 288622, -101129, -1382616, -822649, -287812, 539021, 1284142, 892095, 841745, 210706, -1132255]
8026e29515R9144k69901B0345b74245C49486P91598C654M40541M72944f87990
8037a254130K27704N10295D61526r0922L74765M42189b85911B50374K89829a103916
8048f73428A20081b22307Q6359l1102C36425R70086C28567j14035J50103h43982
8059e30009M5358n20295B52913M28024k46560P51578B94626c22077J07356m68704
8069f83425L00187J33539l13037E22279J3793j03224O32080a27154n08025A42482
8080e62465J65211A05791c96245E73771k39991d53374D4804d0705D50610K14722
8090F65332g48169K58114A21641i08295b2292E60655A04624O20981k64793a74901
8101b34267o62103C253M79567d09490D5218L96111c52687D84852J0985G7857K47686
$$ y = [-529515, -430371, -700272, 20345, -274245, 349486, 1141084, 3654, 444195, 917139, -687990, -1254130, -1026426, -516131, 461526, 370604, 745369, 1187558, -285911, 250374, 540203, -1103916, -673428, 120081, -222307, -135948, -167050, 336425, 1306511, 328567, 214532, 364635, -843982, -530009, -484651, -1004946, 252913, 680937, 434377, 1185955, 294626, -322077, -214721, -683425, -383238, -249699, -562736, 522279, 536072, 432848, 1064928, -127154, -635179, 142482, -562465, -397254, 105791, -396245, 573771, 333780, -453374, 44804, -40705, 450610, 665332, -748169, -490055, 121641, -908295, -22292, 560655, 104624, 725605, 460812, -174901, -234267, -896370, 3253, 482820, -409490, 45218, 441329, -352687, 484852, 495837, 77857, 325543]
8112C25543g46885J86261B10241c91144f6110C66743D8361L24951a97086D8262
8123A204938c5109m80047a37644j016588N19689G59727j51328K183k50356g4968
8134B62350h25173K28477E30465d05990a94475A56645c85646H32176K86456a33410
8145a10478m30511n12364e3187j24676A54203M46439h5875G17885l25700d90982
8156C12730c37094n55360B8644g6587G0902M57710A26638L75056k31350f50552
8167I8481i1866n58187h9286n07106F5887J164568C6284a06633B94737d59109
8178d9295D0081c52304K7599k99676A83942O46903a54001E57678L17792a043859
8189h85227a69672O0961G65136B92897c47B46223h74208a51060F30990b34759
$$ y = [325543, -746885, -560624, 210241, -391144, -66110, 366743, 48361, 373312, -197086, 48262, 1204938, -35109, -515156, -137644, -1154232, -634543, 759727, 608399, 610582, 360226, -74968, 262350, -825173, -596696, 530465, -405990, -194475, 156645, -385646, 832176, 1118632, -133410, -110478, -540989, -1053353, -53187, -177863, 154203, 600642, -85875, 717885, 392185, -490982, 312730, -337094, -892454, 28644, -76587, 70902, 528612, 126638, 501694, 270344, -650552, 98481, -91866, -650053, -89286, -596392, 65887, 1230455, 36284, -106633, 294737, -459109, -49295, 40081, -352304, -324705, -624381, 183942, 830845, -154001, 557678, 875470, -1043859, -885227, -169672, -108711, 765136, 292897, -347, 246223, -874208, -151060, 630990, -234759]
8200A61072a22139n80605D74186j47498b31925C77258d89551r7510B09489A8112
8211E81530J32444b9518G3102a029197K77451H77312F3828e76901A88421c06996
8222B07873P47192A57525J20041a34283m22800J5153m09980c61302I57230A47120
8233F91134N09741e6346I7284b64994j081728K14500L64489B56607Q62839n21646
8243E97800O55924l65520i35210d52110o388j123058f69916a20666E35440J176979
8253A712419G98165l13306K66409f75577l26985P8557p8926C3918N5113J79244
8263B68275J113525F35005J28016O08097i62614r64166N69531K52053a48472C23661
8274A306474Q87236E35331A20077L78003a307645l82306Q01377k38309e8017H68542
$$ y = [161072, -122139, -702744, 474186, 326688, -231925, 377258, -489551, -587061, 209489, 18112, 581530, 713974, -29518, 73102, -1029197, -751746, 877312, 63828, -576901, 188421, -306996, 207873, 955065, 157525, 277566, -134283, -557083, -541930, -951910, -361302, 957230, 147120, 691134, 1200875, -56346, 97284, -264994, -1346722, -1132222, -767733, 256607, 1119446, 597800, 1253724, 888204, -935210, -452110, -458498, -1581556, -669916, -120666, 535440, 1712419, 798165, 484859, 751268, -675577, -1002562, -924005, -1002931, 33918, 89031, 268275, 1381800, 635005, 763021, 1371118, -962614, -1926780, -1357249, -1105196, -148472, 323661, 1306474, 2193710, 535331, 120077, 498080, -1307645, -1689951, -888574, -1126883, -58017, 868542]
8285A308917P35075H65981C4606c47943j648452L89138f66692M1449F77400N41062
8295A218462j06534P16154F25946h85022K96099p60104p9339N59219d09114A214640
8306A735019o12083J50253a94404q24442L77373r71591L01514D01332J77799N42280
8316A121411J29606n19458l6517b06136r04012M08212r42622P23076I05789C58623
8327A110350O17303C50527b57764m57084n99606M29694k32468g8085A379898o21606
8337G58292L33430Q4097b73390k68687p67825m79359b88727A76890N09122Q62843
8347A548855F79062k76789j6477h24595l42504j44543O10573H30207C81908j59126
8357B22782J421175E83406c92999a16860p67613O6847K96716l6811D85002j09563
$$ y = [1308917, 2043992, 865981, 34606, -347943, -1996395, -1607257, -666692, -625243, 677400, 1218462, 1111928, 1828082, 625946, -885022, -588923, -1349027, -1428366, -869147, -409114, 1214640, 1735019, 1122936, 1273189, -194404, -1018846, -641473, -1613064, -1311550, 401332, 579131, 1121411, 1251017, 731559, 695042, -206136, -1110148, -701936, -1644558, -921482, 905789, 358623, 1110350, 1727653, 350527, -257764, -714848, -1314454, -884760, -1117228, -78085, 1379898, 758292, 1091722, 1175819, -273390, -542077, -1309902, -1789261, -288727, 176890, 686012, 1548855, 679062, 402273, 385796, -824595, -1167099, -1311642, -701069, 830207, 381908, 222782, 1643957, 583406, -392999, -116860, -884473, -817626, -520910, -557721, 485002, 375439]
8367C75439L36739J015119D42566f13057n0590j175803P65728a86949D6795J352785
8377A399580j19984E14088M08719a75599r93755j59522m48033g04971C64781J66542
8387E31323J524921p6337C84661a70772j367207m10827f30118L1405a02596H13730
8398G59457J116690m91670b3308j52354j241049m65704h95052l490C94583J584788
8408A979371o28223j75490l86206d23054m09532j043105L399e46673L4013H02915
8419B406979o49726o47093A49618a458942Q0200k79614J65214E1893M64997P77041
8429A293931J018297r89874D65112c21875j398332N6254k35706L79370A172427
8439A704384l72818M60885p56653a1607p35021j423968L43452M57049e89837A674800
$$ y = [375439, 712178, 1727297, 442566, -613057, -663647, -1839450, -1073722, -186949, 46795, 1399580, 1279596, 514088, 922807, -175599, -1169354, -1328876, -1776909, -704971, 364781, 531323, 2056244, 1979907, 384661, -170772, -1537979, -1948806, -630118, -598713, -102596, 813730, 759457, 1876147, 1384477, -23308, -175662, -1416711, -1882415, -895052, -898542, 394583, 1979371, 1351148, 1175658, 789452, -423054, -832586, -1875691, -1872292, -546673, -512660, 802915, 2406979, 1757253, 1110160, 149618, -1458942, -1378742, -1658356, -1493142, 51893, 516890, 1293931, 2312228, 1322354, 465112, -321875, -1720207, -1663953, -1899659, -1520289, 1172427, 1704384, 1331566, 1792451, 1035798, -11607, -746628, -2170596, -1827144, -1370095, -589837, 1674800]
8450A882678m10307L27705E5977a307318K6308m47061O95159b49679E6239J325868
8460A382107J59689k81489Q5783b78922q68497k86690p30115h62105G87587k18681
8470E68906P61256K97563p25320k43186h16570p84922K1271k74807d74192G75736
8481I82581J076020k54982g6791n48255r29047k70955e84801J9205E4363J477005
8491A531368o5082R1000C87769f46241Q4129j021828J13023A69918l2672L50308
8501D87554J006769n29346j97088A85708f09613r187p52814q519B22401H2533
8512F67815J107592H27894B30451d44704q00394L63576K5416k97922E20937P47541
8522A268478K26003k34941a41429l06556m24103j075194g12242c15463a07892
$$ y = [1882678, 1472371, 1800076, 55977, -1307318, -1281010, -1728071, -1032912, -249679, 56239, 1382107, 1541796, 1260307, 1346090, -278922, -1147419, -1434109, -2164224, -862105, 787587, 568906, 1330162, 1627725, 902405, 659219, -816570, -1601492, -1580221, -1855028, -474192, 775736, 982581, 2058601, 1803619, -76791, -625046, -1554093, -1825048, -584801, -565596, 54363, 1531368, 1466286, 1557286, 387769, -646241, -562112, -1583940, -1470917, 169918, 137246, 487554, 1494323, 964977, 767889, 185708, -609613, -618800, -1371614, -1380133, 222401, 82533, 667815, 1775407, 827894, 230451, -444704, -1245098, -881522, -856106, -1154028, 520937, 1268478, 1494481, 1259540, -141429, -447985, -872088, -1947282, -712242, -315463, -107892]
8532A515027k44319B74833J95300b29269m20666l93609k84403b13280B70772R5614
8542C66386J178666m86935A16701M50775g74982m21417M83127j18524a23025F25624
8553A142860O37925E88813d5531A57722a308408k60165f03309j5492E80652Q46529
8563A427181G13341L43963D78929d29891j72337j019946r750a25344E6800P06957
8573G63757L06601m43283O75102A07993a320647N66515k71037k78432c9579D49815
8584A189717M46845G54988j22108g09420j197503f98521j26417j2498I56974K36812
8594A193786k44872J48345C21481E7759h68392p73165d68464D385a84350A006123
8605H14280r428R2627c68985N3500q1281r07563e57663J05364L5452A217493L1656
$$ y = [1515027, 1270708, 274833, 470133, -229269, -649935, -1043544, -1327947, -213280, 270772, 366386, 1545052, 1058117, 116701, 567476, -774982, -1196399, -713272, -831796, -123025, 625624, 1142860, 1780785, 588813, -45531, 157722, -1308408, -1568573, -603309, -618801, 580652, 1427181, 713341, 1057304, 478929, -429891, -602228, -1622174, -1631924, -125344, 56800, 763757, 1070358, 627075, 1302177, 107993, -1320647, -754132, -1025169, -1303601, -39579, 449815, 1189717, 1636562, 754988, 632880, -709420, -1906923, -698521, -824938, -837436, 956974, 1193786, 948914, 1097259, 321481, 57759, -868392, -1641557, -468464, 4385, -184350, 1006123, 814280, 804852, 897479, -368985, -315485, -396766, -1304329, -557663, -452299, -416847, 1217493, 1249149]
8616A249149k63537C91231g00304J86254j14647j051224d26233C35020I0852J210638
8626A301490k97787D11411j83917a107301n4040L43856q0795E00060K89341C38818
8637A125831B14257c75597B16635g27481M1741c01325m99386D54452M52131l82827
8647E23756L44595G1030d89540A88632e69793k06190a38235k36429E56429J13602
8657F70031B88623R16645E47546h26926J02586j80164L92339C49012c2023F56231
8668E53662c02324H48500B62855a190639c22104j00804k04916D30019j20090M40137
8678G50066l00436f02283A800a37755o01001C0532K2173a58174C98880b15918
8689D89498M97582d31053J84238m7454m92233C41406P1199a2516B12798c47945
$$ y = [1249149, 985612, 391231, -700304, -514050, -628697, -1679921, -426233, 335020, 90852, 1301490, 1003703, 411411, 227494, -1107301, -1161341, -817485, -898280, 500060, 789401, 338818, 1125831, 214257, -375597, 216635, -727481, -685740, -301325, -800711, 454452, 906583, 523756, 868351, 71030, -489540, 188632, -569793, -775983, -138235, -374664, 556429, 670031, 288623, 1205268, 547546, -826926, -724340, -904504, -512165, 349012, -32023, 656231, 553662, -302324, 848500, 262855, -1190639, -322104, -422908, -627824, 430019, 309929, 750066, 449630, -602283, 1800, -137755, -738756, 30532, 52705, -158174, 398880, -215918, 489498, 987080, -431053, -246815, -294269, -786502, 341406, 412605, -12516, 212798, -347945]
8700C06531K57990e83687c5886F96610f22288G0583Q5066k35N41007b40562r2335
8711c32897A26735b84387D14603j15001f13442A32194D2917d72007F95244A85633
8722b95597b0487n55873a86519B97857a6278E97446A66242c43506D10864c90309
8733e04288C17370b33764a09114C37296f3191F74472l24447g31542c07576p8966
8743c86542a69371E23155a66986A89954J82756e68782A05455L23188d87018D61007
8754A71649e15668f6091A7343M10198j41582c97921C57785O4651e58694D79272
8765C14071f34886c3304l4685D981O76505a62776a708m4227o65075A62211e1098
8777c59517F10811I5731c29746C55566e42404a87595D78828d96460h7506C31328
$$ y = [306531, 564521, -583687, -35886, 696610, -622288, 70583, 155649, 155414, 696421, -240562, -332897, 126735, -284387, 414603, 299602, -613442, 132194, 42917, -472007, 695244, 185633, -295597, -20487, -576360, -186519, 297857, -16278, 597446, 166242, -343506, 410864, -390309, -504288, 317370, -233764, -109114, 337296, -63191, 674472, 350025, -731542, -307576, -386542, -169371, 523155, -166986, 189954, 372710, -568782, 105455, 428643, -487018, 461007, 171649, -515668, -66091, 17343, 427541, 285959, -397921, 357785, 422436, -558694, 479272, 314071, -634886, -33304, -67989, 4981, 681486, -162776, -1708, -45935, -711010, 162211, -51098, -359517, 610811, 95731, -329746, 355566, -542404, -187595, 478828, -496460, -87506, 331328]
8788I1997L55969e33950l4299B18917c34713A29132N12771b44258D60861o9673
8798C91188f21894c0947A1602c00827B75727a66009D4860M73772h2216D97712
8809D6023g75495A65457a80599n82677D75633A30151g6942B22789G013N80879
8819E87892I6914h64503a1719o9089p10585B29028a34370A94367O39542a22434
8830a80755C6514f19995a01041j1109m02320B47654R4137N117K0175d32944F6321
8842C38521i56116c94082H6662c03161D78867P0941j65042M2422d67072J7863
8852d49209a01059p78775b274D81417d56066F77808n8296a59658A94737d25178
8863d94017a95598m87670A14303N63891B51030L62060c2119l59993D43511b91832
$$ y = [91997, 447966, -533950, -568249, 218917, -334713, 129132, 641903, -244258, 460861, 391188, -621894, -30947, 11602, -300827, 275727, -166009, 44860, 518632, -82216, 497712, 46023, -775495, 165457, -180599, -763276, 475633, 130151, -76942, 222789, 7013, 587892, 96914, -864503, -11719, -80808, -791393, 229028, -134370, 194367, 833909, -122434, -180755, 36514, -619995, -101041, -112150, -514470, 247654, 341791, 346908, 367083, -432944, 66321, 338521, -956116, -394082, 86662, -303161, 478867, 549808, 384766, 427188, -467072, -449209, -101059, -879834, -2274, 481417, -456066, 677808, 619512, -159658, 194737, -425178, -494017, -195598, -683268, 114303, 678194, 251030, 613090, -32119, -392112, 443511, -291832]
8874f43414A7221c76207B1808N42652a07043F19279j12179b81251Q6460m25537
8884f20328Q4713B01102c37466A21073N28342A19347O52202j66688h02759K26864
8894e75895l7614K5348A20526L48434N41198k99191d47891B47347N8276a030643
8905a92086p911l28431D10376A34759M62200K59271b44623O9778k08234n29850
8915i12929H6101J40923b93130A10384a63854E45225M81796a23588B5242R0689
8925A15931a253652M05248a70009B64866P80749D20128j01040K12468f10907a50612
8936B12842a139276d64434A56038n5077O05205k4683A02950c4358j046105d90627
8947B83299b43130B62537n5485a45563F09692B45136b11558D14682c54983l29311
$$ y = [-643414, 17221, -376207, 21808, 564460, -107043, 619279, 507100, -281251, -194791, -620328, -535615, 201102, -337466, 121073, 649415, 119347, 771549, 604861, -802759, -575895, -613509, -588161, 120526, 468960, 1010158, 710967, -447891, 247347, 305623, -1030643, -192086, -199997, -528428, 410376, 134759, 596959, 856230, -244623, -174845, -383079, -912929, 86101, 227024, -293130, 110384, -163854, 545225, 1027021, -123588, 25242, 115931, -1253652, -848404, -170009, 264866, 1045615, 420128, 319088, 531556, -610907, -150612, 212842, -1139276, -464434, 156038, 100961, 706166, 681483, 102950, -34358, -1080463, -490627, 283299, -243130, 262537, 207052, -145563, 609692, 245136, -211558, 414682, -354983, -684294]
8957f84294c30115j61727D46915L32047C3527J97688h6638k6620C33850e93790
8968g77728A18182d23394B24497P31568B16478N8255F0460f61263b67956j65757
8978d33713B19740L37799e92948A08195O84744b00106C15140K78584e89502J3032
8988e76470K8507F684O68166G6103J48891K28537d95974A93638R0207e35399b7195
9000b64846m2962D38393A01342J78035M85533d17872l20098c53114f3665F96555
9011F0614b88820C84007c84876Q1F18764a05216k8208D77035b06661N9263a3180
9023A75348L58575b93239A4917O77491d66217a06060A10436f99146d0819C41663
9034i6201F10235B67321a72166M6241m41355F2806K17250b72875D36067J59280
$$ y = [-684294, -330115, -491842, 446915, 778962, 33527, 231215, -86638, -113258, 333850, -593790, -777728, 118182, -423394, 224497, 956065, 216478, 274733, 60460, -661263, -267956, -433713, 219740, 557539, -592948, 108195, 792939, -200106, 315140, 593724, -589502, -576470, -547963, 6684, 674850, 76103, 224994, 453531, -495974, 193638, 283845, -535399, -27195, -264846, -307808, 438393, 101342, 279377, 764910, -417872, -737970, -353114, -63665, 696555, 60614, -288820, 384007, -384876, -384795, 618764, -105216, -133424, 477035, -206661, -147398, -13180, 175348, 533923, -293239, 14917, 692408, -466217, -106060, 110436, -699146, -40819, 341663, -96201, 610235, 267321, -172166, -125925, -567280, 62806, 280056, -272875, 436067, 595347]
9044E95347b56873A33413b39837m01483B42485c1909j33B28068d0584D36581a6815
9056g22349I6899d001p7782E44788b46703l9460E31035c23046j42508C27138A20514
9068A46777a55746j35371B36277d33505C5774Q07056a69518B2046M68219e16157
9079a05642B24361a48584I9300a42673b1960C71650d34744C2115L92030a69043
9090B8551g0470m25000F07532B96815e14166G9559b62847d5904D75550A07200
9101B53264I1039d66172A055e29681b61956H73745g2638m27116C16354e4608B47466
9113F47054b33499k3758m55449J04340C10591A25181K96673M72722c55750F4879
9124E63574g33274K33821M5353m0496B42690R7008L06717L38497i9085l4925j70208
$$ y = [595347, -256873, 133413, -239837, -641320, 242485, -31909, -32042, 228068, -40584, 436581, -16815, -722349, 96899, -4001, -81783, 544788, -246703, -286163, 531035, -323046, -465554, 327138, 120514, 146777, -155746, -291117, 236277, -433505, 35774, 842830, -169518, 22046, 490265, -516157, -105642, 224361, -148584, 99300, -142673, -21960, 371650, -434744, 32115, 424145, -169043, 28551, -70470, -495470, 607532, 296815, -514166, 79559, -262847, -45904, 475550, 107200, 253264, 91039, -466172, 1055, -529681, -261956, 873745, -72638, -499754, 316354, -54608, 247466, 647054, -233499, -257257, -712706, -608366, 310591, 125181, 421854, 894576, -355750, 64879, 563574, -733274, -499453, -454100, -494596, 242690, 339698, 646415, 984912, -99085, -134010, -304218]
9135c04218r80723a00794D48494d44256F5999K03109L1570R27957H3414c47893
9146c08442n95961K53791a72245K3090G21576C24291A56389Q94108A44556b76901
9157f6695j288865J8585b61787C34031Q30078j32797l38930C24596a256379L60337
9167h96042B17976f01876J84717A88544n9939O52568L18516C61977J09520d99447
9178a105193N00425j65882B50517N58915A60213L46634A89763F8737P36827a26102
9189a263790N75078k17514a99415H43748J51221L81658D87601c88035j04921n52200
9199a045156M9047F6021c76821C060J369609E82538n6681R987e53129k40191m90065
9210a283385N93871F71418B07789L76004N30508a3653A83007R1739a030313L2492
$$ y = [-304218, -1284941, -100794, 448494, -444256, 65999, 269108, 300678, 1228635, 83414, -347893, -308442, -904403, -650612, -172245, -149155, 721576, 324291, 156389, 1050497, 144556, -276901, -66695, -1355560, -1336975, -261787, 334031, 1164109, 1031312, 692382, 324596, -1256379, -896042, 217976, -601876, -417159, 188544, 128605, 781173, 1099689, 361977, 471497, -499447, -1105193, -604768, -770650, 250517, 809432, 160213, 506847, 189763, 68737, 805564, -126102, -1263790, -688712, -906226, -199415, 843748, 994969, 1376627, 487601, -388035, -492956, -1045156, -996109, 66021, -376821, 3060, 1372669, 582538, 525857, 535844, -553129, -793320, -1283385, -689514, 671418, 207789, 583793, 1114301, -13653, 183007, 274746, -1030313, -997821]
9220i97821K71139K94542D84145k3033M44593M59256A57242d65794k8463l69702
9230h63959b78445j35156q5764H47150K6594j78933M73720G1451h04291j60560
9240i64851r1793N18646a805D58864J143091D03079e448H86380c48633o28564
9250i77197d62130m56432K72785a5008E92345J094918o15084A89345f1283j248804
9260a310087M9617b73778n63223H1796R60840m33763N52441E33427b42790J14461
9270a28329r25944k39443O46295b87645A081348M41074E20674K89746A69876a056125
9281e47829l44407r6140B07077K33674J59136M14037j95878n0432b46186p73478
9291a019664d90053r24859J60955G13473n4705K25938P80519D62829c40375l70441
$$ y = [-997821, -726682, -432140, 484145, 461112, 905705, 1364961, 157242, -465794, -494257, -863959, -278445, -413601, -499365, 847150, 873744, 694811, 1168531, 71451, -804291, -964851, -1056644, -537998, -1805, 458864, 1601955, 403079, -5448, 886380, -348633, -977197, -462130, -918562, -645777, -15008, 592345, 1687263, 1072179, 189345, -61283, -1310087, -1260470, -273778, -837001, 81796, 1042636, 608873, 1161314, 533427, -242790, -128329, -1054273, -1293716, -647421, -287645, 1081348, 1522422, 520674, 810420, 169876, -1056125, -547829, -892236, -988376, 207077, 440751, 599887, 1013924, 818046, 767614, -246186, -1019664, -490053, -1414912, -1253957, 713473, 658768, 884706, 1665225, 462829, -340375, -710816]
9301g10816o91174K84522j795a42091A381842n42477J33545L42822a37700n73742
9311g11442p59414l11317g05140E8098M17437R30307k65124j73260l74290g50008
9322i10091k04056m34958A31999L45257p2205J465444l81190E4659Q5171f27673
9333i62100n75464K38696A71792N26078L01553J389027j107293b14088k58416
9342d72504j299495j03241f33635b20144F42810L01653M6581N25819D98647d29029
9353f97233j209561K10628f66824L27232A359716Q84862A010337C69016d26966
9363a048496K22442m19303M81191b02156A2816J174978N22811o85659r809c92346
9374b063887N38786L64007c68265A145957L268K3170q1422B25820L7901f59792
$$ y = [-710816, -1401990, -1117468, -1119263, -142091, 1381842, 839365, 972910, 1315732, -137700, -711442, -1470856, -1782173, -705140, 58098, 475535, 1405842, 1140718, 967458, 593168, -750008, -910091, -1114147, -1549105, 131999, 477256, 405051, 1870495, 1489305, 54659, 139830, -627673, -962100, -1537564, -1298868, 171792, 697870, 999423, 2388450, 1281157, -214088, -472504, -1771999, -1875240, -633635, -220144, 642810, 944463, 991044, 1516863, 498647, -429029, -697233, -1906794, -1696166, -666824, -339592, 1359716, 2244578, 1010337, 369016, -426966, -1048496, -826054, -1245357, -764166, -202156, 12816, 1187794, 1710605, 1024946, 1015137, -392346, -2063887, -1525101, -1161094, -368265, 1145957, 1149225, 1172395, 1090973, 225820, 263721, -659792]
9385a612659g68037k22117L80574A376495K44721o47804l507f7159m69935o15908
9395a153002l00146O96696K78828A27541J336070m19465j6317j81357g90197q52276
9405a642473K86814N1419A71664M24090N1028N34263l63417j89752D7243a285306
9416a157056J8149j95935E36267Q39744l02258K10498B89550f64893J08164l18408
9426h75137c96136J91450k51156C84715L27767K2680R55606F13372h01833k05537
9436a007370n88101P40479C40569K55618M37362j06376k94166q7381e67988l27021
9446h95009c22469j028984K90966D00370K96210J066227k13906A61089c95696
9456a199559j73298f86070K58120A35829P01726k79767L06704k45575b77977l5356
$$ y = [-1612659, -768037, -990154, -609580, 1376495, 1621216, 973412, 969905, -67159, -537094, -1153002, -1453148, -756452, -477624, 127541, 1463611, 1044146, 1027829, 846472, -790197, -1642473, -1355659, -1304240, 171664, 595754, 646782, 1181045, 817628, 627876, 47243, -1285306, -1157056, -1138907, -1334842, 536267, 1376011, 1073753, 1284251, 289550, -664893, -556729, -875137, -396136, -204686, -455842, 384715, 712482, 735162, 1690768, 613372, -801833, -1007370, -1595471, -854992, 340569, 596187, 1033549, 927173, 633007, 545626, -567988, -895009, -322469, -1351453, -1060487, 400370, 696580, 1762807, 1548901, 161089, -395696, -1199559, -1372857, -686070, -427950, 135829, 837555, 557788, 864492, 618917, -277977, -313333]
9466c13333o90399m67488b95878E2263J66046R01339K0415l11074A71192g31722
9477d45426n75877k55287D2368M02759M04616R45177q09182B18149b52841n22515
9487g75356o2910j54662q4112C26010N47365K13496L95830F18794A00139e52552
9498a916129O33600c52800b0334A078474K7962E18295L31892A05395d24130k76256
9508g00386o50432M38100M36911N0209A101228M46406F37325R9599c00541r28433
9518a228974M1095J7073e14143B71740K23990P70492n30552B89304N13714c00611
9529a337301N66833n0577c82991B90729L87692P85130k46492A96345f2619q92496
9539i55115j88755b44699l09384a74994G12799o9905L58999j32771a26672A1328
$$ y = [-313333, -1003732, -1471220, -295878, 52263, 218309, 1119648, 1140063, 828989, 171192, -731722, -445426, -1021303, -1276590, 42368, 445127, 849743, 1794920, 985738, 218149, -252841, -775356, -838266, -992928, -1077040, 326010, 873375, 1086871, 1482701, 618794, 100139, -552552, -1916129, -1282529, -352800, -20334, 1078474, 1106436, 518295, 850187, 105395, -424130, -700386, -1350818, -912718, -475807, -425598, 1101228, 1547634, 637325, 736924, -300541, -1228974, -1187879, -1170806, -514143, 271740, 495730, 1266222, 735670, 289304, 803018, -300611, -1337301, -770468, -821045, -382991, 290729, 678421, 1463551, 1217059, 196345, -62619, -955115, -1143870, -244699, -554083, -174994, 712799, 642894, 1001893, 869122, -126672, 11328]
9550g29058p14942L36008d32302F71398N36322n14554K71621A57841a335396e25839
9561b16878o76884a05824H1147A9124N88442j95960K65854d3697q38546a33059
9572c76650n71931B98608K12508B11696L48418I5261R9673L12015c91248j1805
9582d03053k12669J23883G10749k40453o8037M60636e0505p0968A21958h70237
9593d90191B57437a49715D16576L69284l87774A46615g28167K52330a47554l32030
9603d79584E47291L4205d11564A19592b9322m72866E09890j79856a81484l49578
9613e31062p9722C33802K60073F431N69229c0759q13968c3226n4288j15474E01959
9625a02294j70666f0971A09279P33057k14051d15227j63731j96568c63082H20134
$$ y = [-729058, -1444000, -1107992, -432302, 671398, 1207720, 693166, 964787, 157841, -1335396, -525839, -216878, -893762, -105824, 81147, 19124, 607566, 411606, 677460, -43697, -882243, -133059, -376650, -948581, 298608, 511116, 211696, 560114, 95261, 194934, 506949, -391248, -403053, -615722, -491839, 710749, 470296, 402259, 862895, -50505, -121473, 121958, -870237, -490191, 257437, -149715, 416576, 785860, 398086, 146615, -728167, -475837, -147554, -479584, 547291, 581496, -411564, 119592, -29322, -502188, 509890, 330034, -181484, -531062, -610784, 333802, 593875, 6431, 575660, -30759, -844727, -33226, -87514, -202988, 501959, -102294, -272960, -60971, 109279, 842336, 628285, -415227, -578958, -775526, -363082, 820134]
9636C54168K64598o8367f47398K78059C75262b15553C927b1124k50624g776j93148
9647b00924E85371K61873d18711a10078N4157r48231b82275D71030a26313A03846
9658E454M02613J95295c03936o55M0114m43589A58809K0710b12707F91033B58974
9670b11355A45797b96855e4876H5990d72195b04097D7775J72765N23816f3209
9681d41979C03685b18632e2772D58741c61688a55308Q122j57101F16114J18770
9691G34884B64292A14488h71938L16004a35288k09624E40789L26053c33136c6658
9702B6909b45879D59508A58889b33517L4089k35460C36902k0920e63383C89404
9713B19728d56500A99710I853i432B57339f50505J19230E3401g9593G48987j96363
$$ y = [354168, 618766, 550399, -647398, -369339, 375262, -215553, 3927, -21124, -271748, -7776, -200924, 585371, 847244, -418711, -110078, -55921, -1004152, -282275, 471030, -126313, 103846, 5454, 408067, 603362, -303936, -304591, -264477, -708066, 158809, 179519, -212707, 691033, 258974, -211355, 145797, -296855, -54876, 85990, -472195, -204097, 47775, 220540, 744356, -63209, -441979, 303685, -218632, -52772, 458741, -361688, -155308, -147186, -304287, 616114, 734884, 264292, 114488, -871938, -555934, -135288, -344912, 540789, 866842, -333136, -36658, 26909, -245879, 459508, 158889, -233517, -199428, -434888, 336902, 315982, -563383, 389404, 219728, -456500, 199710, 9853, -9432, 257339, -650505, -531275, 53401, -79593, 748987, 552624]
9724E52624i1949D13381c16123j82392a41587m75067d9766E36305e5848B59610
9735D90542b01770A10626a86222B8009N8541f55787K26814C61209b52824C61985
9746F81538I177L40845a17108o54461L57874a85319g9790B95163b01583D16219
9757F57682B7107K80760d41231n68677b04312k3527h0080F64758l30041K39808
9767E74525k85340c60955A38439a17117n53886h1773l31146J59533E25934A82905
9778F92017K13835c42540J17914j04874l65727c23858O374A21746O06709C31921
9789F44276l12855h08083A9455M6779i33152c22403c4083c316D08743j31772K93864
9800E70835J49338c92847m7170k26581k13758A54729J99441j18038K96559B03401
$$ y = [552624, -91949, 413381, -316123, -498515, -141587, -616654, -49766, 536305, -55848, 259610, 490542, -201770, 110626, -186222, 28009, 86550, -655787, -428973, 361209, -252824, 361985, 681538, 9177, 350022, -117108, -771569, -413695, -185319, -79790, 295163, -201583, 416219, 657682, 27107, 307867, -441231, -1009908, -204312, -227839, -80080, 664758, 334717, 574525, 289185, -360955, 138439, -117117, -671003, -81773, -412919, -253386, 525934, 182905, 692017, 905852, -342540, -224626, -329500, -695227, -323858, -317484, 121746, 728455, 331921, 644276, 331421, -808083, 19455, 66234, -933152, -322403, -34083, -3316, 408743, 276971, 570835, 720173, -392847, -440017, -666598, -880356, 154729, 354170, 236132, 532691, 203401]
9811B80445K48354c68626P4847j12570n48726a09361C26322M05986K93355G0063
9822c89249d84q55702b74602E01523a30462D7427c734j29940B66383L1290M2513
9833C40186A04905f50082e7440C06160f16194E7137L37041b82498D63935A07166
9844b44703B54908b22565a05440k1571m18096E40351M1795b65900A6949a78650
9855d37802A13519b19496h2309E41243b03976B01537m9141d99161O0450M8699
9865c90012O1847E57275B74965K60477j7482g38286c63176A06875d65397f9619
9876D85667c5233j43851q2681E55068M05675b95403q8271a22986o96720D9555
9887D38569F4402K81836j72999C1731A1012a87905D1130M9244h84169L10607e0179
$$ y = [280445, 528799, -368626, -293779, -406349, -955075, -109361, 326322, 732308, 1025663, 70063, -389249, -484, -856186, -274602, 501523, -130462, 47427, -3734, -133674, 266383, 297673, 340186, 104905, -650082, -57440, 306160, -616194, 57137, 394178, -282498, 463935, 107166, -244703, 254908, -222565, -105440, -127011, -545107, 540351, 582146, -265900, 16949, -178650, -437802, 113519, -219496, -82309, 541243, -203976, 201537, 152396, -499161, -438711, -390012, -328165, 557275, 274965, 535442, 517960, -738286, -363176, 106875, -465397, -69619, 485667, -35233, -179084, -261765, 555068, 960743, -295403, -383674, -122986, -819706, 49555, 438569, 64402, 346238, 173239, 31731, 11012, -187905, 41130, 90374, -884169, -573562, -50179]
9899C10311R71425D92909a19747A53877f45926m1910A66461c03641J13540B18025
9910H1202O50761k55447B29616A09545f69501K9309g9276n42422a32623G46217
9921D03042P9512A74274k8366n290f68573m9030c28007k16688F06672K67344e2717
$$ y = [310311, 1281736, 492909, -119747, 153877, -645926, -687836, 166461, -303641, -190101, 218025, 81202, 731963, 476516, 229616, 109545, -669501, -640192, -79276, -621698, -132623, 746217, 403042, 482554, 174274, 145908, 140618, -668573, -717603, -328007, -544695, 606672, 874016, -52717]
$$ [...]
##END NTUPLES=NMR FID
##END=
